BDBM50028005 CHEMBL185823
SMILES: CC(C)(C)c1ccc(cc1)S(=O)(=O)Nc1cccc(O)c1
InChI Key: InChIKey=PFOZVVVJWABLDF-UHFFFAOYSA-N
Data: 1 IC50
Activity Spreadsheet -- Enzyme Inhibition Constant Data from BindingDB
Found 1 hit for monomerid = 50028005
Trg + Lig
Ki
nM
ΔG°
kcal/mole
IC50
nM
Kd
nM
EC50/IC50
nM
koff
s-1
kon
M-1s-1
pHTemp
°C
Cytochrome b-c1 complex subunit 7
(Homo sapiens (Human))
BDBM50028005
(CHEMBL185823)
Show SMILES CC(C)(C)c1ccc(cc1)S(=O)(=O)Nc1cccc(O)c1
Show InChI InChI=1S/C16H19NO3S/c1-16(2,3)12-7-9-15(10-8-12)21(19,20)17-13-5-4-6-14(18)11-13/h4-11,17-18H,1-3H3
n/an/a 8.00E+3n/an/an/an/an/an/a
Yonsei University
Curated by ChEMBL
Assay Description
Modulation of UQCRB in human HepG2 cells assessed as inhibition of HIF-1alpha for 4 hrs under 1%O2 by Western blot analysis
J Med Chem 57: 7990-8 (2014)
Article DOI: 10.1021/jm500863j
BindingDB Entry DOI: 10.7270/Q24Q7WK4