BDBM50028133 2-{4-[(2,4-Diamino-pteridin-6-ylmethyl)-methyl-amino]-benzoylamino}-pentanedioic acid 1-octyl ester::CHEMBL347439
SMILES: CCCCCCCCOC(=O)C(CCC(O)=O)NC(=O)c1ccc(cc1)N(C)Cc1cnc2nc(N)nc(N)c2n1
InChI Key: InChIKey=LGCFACGRJDJIGY-UHFFFAOYSA-N
Data: 1 IC50
Activity Spreadsheet -- Enzyme Inhibition Constant Data from BindingDB
Found 1 hit for monomerid = 50028133
Trg + Lig
Ki
nM
ΔG°
kcal/mole
IC50
nM
Kd
nM
EC50/IC50
nM
koff
s-1
kon
M-1s-1
pHTemp
°C
Dihydrofolate reductase (DHFR)
(Bos taurus (Cattle))
BDBM50028133
(2-{4-[(2,4-Diamino-pteridin-6-ylmethyl)-methyl-ami...)
Show SMILES CCCCCCCCOC(=O)C(CCC(O)=O)NC(=O)c1ccc(cc1)N(C)Cc1cnc2nc(N)nc(N)c2n1
Show InChI InChI=1S/C28H38N8O5/c1-3-4-5-6-7-8-15-41-27(40)21(13-14-22(37)38)33-26(39)18-9-11-20(12-10-18)36(2)17-19-16-31-25-23(32-19)24(29)34-28(30)35-25/h9-12,16,21H,3-8,13-15,17H2,1-2H3,(H,33,39)(H,37,38)(H4,29,30,31,34,35)
n/an/a 360n/an/an/an/an/an/a
TBA
Curated by ChEMBL
Assay Description
Compound was evaluated in vitro for its ability to inhibit the Dihydrofolate reductase extracted from beef liver.
J Med Chem 27: 605-9 (1984)
BindingDB Entry DOI: 10.7270/Q29G5KSG