BDBM50028179 CHEMBL3354624
SMILES: OC[C@@H]1[C@@H](O)[C@H](O)[C@@H](O)CN1CCCCCOCc1ccc(cc1F)-c1ccccc1
InChI Key: InChIKey=DWCDYYDNUCIAGD-UEQSERJNSA-N
Data: 6 IC50
Activity Spreadsheet -- Enzyme Inhibition Constant Data from BindingDB
Found 6 hits for monomerid = 50028179
Trg + Lig
Ki
nM
ΔG°
kcal/mole
IC50
nM
Kd
nM
EC50/IC50
nM
koff
s-1
kon
M-1s-1
pHTemp
°C
Ceramide glucosyltransferase
(Homo sapiens (Human))
BDBM50028179
(CHEMBL3354624)
Show SMILES OC[C@@H]1[C@@H](O)[C@H](O)[C@@H](O)CN1CCCCCOCc1ccc(cc1F)-c1ccccc1 |r|
Show InChI InChI=1S/C24H32FNO5/c25-20-13-18(17-7-3-1-4-8-17)9-10-19(20)16-31-12-6-2-5-11-26-14-22(28)24(30)23(29)21(26)15-27/h1,3-4,7-10,13,21-24,27-30H,2,5-6,11-12,14-16H2/t21-,22+,23-,24-/m1/s1
NCI pathway
Reactome pathway
n/an/a 25n/an/an/an/an/an/a
Leiden University
Curated by ChEMBL
Assay Description
Inhibition of glucosylceramide synthase (unknown origin) assessed as catabolism of NBD-glucosylceramide
J Med Chem 57: 9096-104 (2014)
Article DOI: 10.1021/jm501181z
BindingDB Entry DOI: 10.7270/Q20003PT
Lysosomal acid glucosylceramidase
(Homo sapiens (Human))
BDBM50028179
(CHEMBL3354624)
Show SMILES OC[C@@H]1[C@@H](O)[C@H](O)[C@@H](O)CN1CCCCCOCc1ccc(cc1F)-c1ccccc1 |r|
Show InChI InChI=1S/C24H32FNO5/c25-20-13-18(17-7-3-1-4-8-17)9-10-19(20)16-31-12-6-2-5-11-26-14-22(28)24(30)23(29)21(26)15-27/h1,3-4,7-10,13,21-24,27-30H,2,5-6,11-12,14-16H2/t21-,22+,23-,24-/m1/s1
Reactome pathway
n/an/a 250n/an/an/an/an/an/a
Leiden University
Curated by ChEMBL
Assay Description
Inhibition of GBA1 (unknown origin) using beta-D-[1-14C]glucocerebroside assessed as 4-methylumbelliferrone by fluorimetry
J Med Chem 57: 9096-104 (2014)
Article DOI: 10.1021/jm501181z
BindingDB Entry DOI: 10.7270/Q20003PT
Maltase-glucoamylase
(Homo sapiens (Human))
BDBM50028179
(CHEMBL3354624)
Show SMILES OC[C@@H]1[C@@H](O)[C@H](O)[C@@H](O)CN1CCCCCOCc1ccc(cc1F)-c1ccccc1 |r|
Show InChI InChI=1S/C24H32FNO5/c25-20-13-18(17-7-3-1-4-8-17)9-10-19(20)16-31-12-6-2-5-11-26-14-22(28)24(30)23(29)21(26)15-27/h1,3-4,7-10,13,21-24,27-30H,2,5-6,11-12,14-16H2/t21-,22+,23-,24-/m1/s1
n/an/a 2.50E+3n/an/an/an/an/an/a
Leiden University
Curated by ChEMBL
Assay Description
Inhibition of intestinal maltase (unknown origin)
J Med Chem 57: 9096-104 (2014)
Article DOI: 10.1021/jm501181z
BindingDB Entry DOI: 10.7270/Q20003PT
Sucrase-isomaltase, intestinal
(Homo sapiens (Human))
BDBM50028179
(CHEMBL3354624)
Show SMILES OC[C@@H]1[C@@H](O)[C@H](O)[C@@H](O)CN1CCCCCOCc1ccc(cc1F)-c1ccccc1 |r|
Show InChI InChI=1S/C24H32FNO5/c25-20-13-18(17-7-3-1-4-8-17)9-10-19(20)16-31-12-6-2-5-11-26-14-22(28)24(30)23(29)21(26)15-27/h1,3-4,7-10,13,21-24,27-30H,2,5-6,11-12,14-16H2/t21-,22+,23-,24-/m1/s1
Reactome pathway
n/an/a 250n/an/an/an/an/an/a
Leiden University
Curated by ChEMBL
Assay Description
Inhibition of intestinal sucrase (unknown origin)
J Med Chem 57: 9096-104 (2014)
Article DOI: 10.1021/jm501181z
BindingDB Entry DOI: 10.7270/Q20003PT
Lactase/phlorizin hydrolase
(Homo sapiens (Human))
BDBM50028179
(CHEMBL3354624)
Show SMILES OC[C@@H]1[C@@H](O)[C@H](O)[C@@H](O)CN1CCCCCOCc1ccc(cc1F)-c1ccccc1 |r|
Show InChI InChI=1S/C24H32FNO5/c25-20-13-18(17-7-3-1-4-8-17)9-10-19(20)16-31-12-6-2-5-11-26-14-22(28)24(30)23(29)21(26)15-27/h1,3-4,7-10,13,21-24,27-30H,2,5-6,11-12,14-16H2/t21-,22+,23-,24-/m1/s1
n/an/a 3.00E+4n/an/an/an/an/an/a
Leiden University
Curated by ChEMBL
Assay Description
Inhibition of intestinal lactase (unknown origin)
J Med Chem 57: 9096-104 (2014)
Article DOI: 10.1021/jm501181z
BindingDB Entry DOI: 10.7270/Q20003PT
Non-lysosomal glucosylceramidase
(Homo sapiens (Human))
BDBM50028179
(CHEMBL3354624)
Show SMILES OC[C@@H]1[C@@H](O)[C@H](O)[C@@H](O)CN1CCCCCOCc1ccc(cc1F)-c1ccccc1 |r|
Show InChI InChI=1S/C24H32FNO5/c25-20-13-18(17-7-3-1-4-8-17)9-10-19(20)16-31-12-6-2-5-11-26-14-22(28)24(30)23(29)21(26)15-27/h1,3-4,7-10,13,21-24,27-30H,2,5-6,11-12,14-16H2/t21-,22+,23-,24-/m1/s1
Reactome pathway
n/an/a 0.0800n/an/an/an/an/an/a
Leiden University
Curated by ChEMBL
Assay Description
Inhibition of GBA2 (unknown origin)
J Med Chem 57: 9096-104 (2014)
Article DOI: 10.1021/jm501181z
BindingDB Entry DOI: 10.7270/Q20003PT