BDBM50028203 CHEMBL3354021
SMILES: OC[C@@H]1[C@@H](O)[C@H](O)[C@@H](O)CN1CCCCCOCc1ccccc1
InChI Key: InChIKey=JLJXOROVAFNSCP-XMTFNYHQSA-N
Data: 3 IC50
Activity Spreadsheet -- Enzyme Inhibition Constant Data from BindingDB
Found 3 hits for monomerid = 50028203
Trg + Lig
Ki
nM
ΔG°
kcal/mole
IC50
nM
Kd
nM
EC50/IC50
nM
koff
s-1
kon
M-1s-1
pHTemp
°C
Ceramide glucosyltransferase
(Homo sapiens (Human))
BDBM50028203
(CHEMBL3354021)
Show SMILES OC[C@@H]1[C@@H](O)[C@H](O)[C@@H](O)CN1CCCCCOCc1ccccc1 |r|
Show InChI InChI=1S/C18H29NO5/c20-12-15-17(22)18(23)16(21)11-19(15)9-5-2-6-10-24-13-14-7-3-1-4-8-14/h1,3-4,7-8,15-18,20-23H,2,5-6,9-13H2/t15-,16+,17-,18-/m1/s1
NCI pathway
Reactome pathway
n/an/a 750n/an/an/an/an/an/a
Leiden University
Curated by ChEMBL
Assay Description
Inhibition of glucosylceramide synthase (unknown origin) assessed as catabolism of NBD-glucosylceramide
J Med Chem 57: 9096-104 (2014)
Article DOI: 10.1021/jm501181z
BindingDB Entry DOI: 10.7270/Q20003PT
Non-lysosomal glucosylceramidase
(Homo sapiens (Human))
BDBM50028203
(CHEMBL3354021)
Show SMILES OC[C@@H]1[C@@H](O)[C@H](O)[C@@H](O)CN1CCCCCOCc1ccccc1 |r|
Show InChI InChI=1S/C18H29NO5/c20-12-15-17(22)18(23)16(21)11-19(15)9-5-2-6-10-24-13-14-7-3-1-4-8-14/h1,3-4,7-8,15-18,20-23H,2,5-6,9-13H2/t15-,16+,17-,18-/m1/s1
Reactome pathway
n/an/a 1n/an/an/an/an/an/a
Leiden University
Curated by ChEMBL
Assay Description
Inhibition of GBA2 (unknown origin)
J Med Chem 57: 9096-104 (2014)
Article DOI: 10.1021/jm501181z
BindingDB Entry DOI: 10.7270/Q20003PT
Lysosomal acid glucosylceramidase
(Homo sapiens (Human))
BDBM50028203
(CHEMBL3354021)
Show SMILES OC[C@@H]1[C@@H](O)[C@H](O)[C@@H](O)CN1CCCCCOCc1ccccc1 |r|
Show InChI InChI=1S/C18H29NO5/c20-12-15-17(22)18(23)16(21)11-19(15)9-5-2-6-10-24-13-14-7-3-1-4-8-14/h1,3-4,7-8,15-18,20-23H,2,5-6,9-13H2/t15-,16+,17-,18-/m1/s1
Reactome pathway
n/an/a 300n/an/an/an/an/an/a
Leiden University
Curated by ChEMBL
Assay Description
Inhibition of GBA1 (unknown origin) using beta-D-[1-14C]glucocerebroside assessed as 4-methylumbelliferrone by fluorimetry
J Med Chem 57: 9096-104 (2014)
Article DOI: 10.1021/jm501181z
BindingDB Entry DOI: 10.7270/Q20003PT