BDBM50028387 CHEMBL3342292
SMILES: [O-][N+](=O)c1ccc(CSc2ccc(cn2)C(=O)Nc2ccc(F)cc2)cc1
InChI Key: InChIKey=ARSWLECEUGEWQH-UHFFFAOYSA-N
Data: 1 IC50
Activity Spreadsheet -- Enzyme Inhibition Constant Data from BindingDB
Found 1 hit for monomerid = 50028387
Trg + Lig
Ki
nM
ΔG°
kcal/mole
IC50
nM
Kd
nM
EC50/IC50
nM
koff
s-1
kon
M-1s-1
pHTemp
°C
C-X-C chemokine receptor type 2
(Homo sapiens (Human))
BDBM50028387
(CHEMBL3342292)
Show SMILES [O-][N+](=O)c1ccc(CSc2ccc(cn2)C(=O)Nc2ccc(F)cc2)cc1
Show InChI InChI=1S/C19H14FN3O3S/c20-15-4-6-16(7-5-15)22-19(24)14-3-10-18(21-11-14)27-12-13-1-8-17(9-2-13)23(25)26/h1-11H,12H2,(H,22,24)
Reactome pathway
n/an/a>5.00E+3n/an/an/an/an/an/a
Syntrix Biosystems
Curated by ChEMBL
Assay Description
Antagonist activity at CXCR2 in human PMNs assessed as inhibition of CXCL1-induced intracellular Ca2+ release by fluorescence based calcium flux assa...
J Med Chem 57: 8378-97 (2014)
Article DOI: 10.1021/jm500827t
BindingDB Entry DOI: 10.7270/Q2FX7C22