BDBM50028505 CHEMBL3342468
SMILES: CCCCN[C@H]1CC(=C[C@@H](OC(CC)CC)[C@@H]1NC(C)=O)C(O)=O
InChI Key: InChIKey=DWAAMBNIPRFPIV-GVDBMIGSSA-N
Data: 4 IC50
Activity Spreadsheet -- Enzyme Inhibition Constant Data from BindingDB
Found 4 hits for monomerid = 50028505
Trg + Lig
Ki
nM
ΔG°
kcal/mole
IC50
nM
Kd
nM
EC50/IC50
nM
koff
s-1
kon
M-1s-1
pHTemp
°C
Neuraminidase
(Influenza A virus)
BDBM50028505
(CHEMBL3342468)
Show SMILES CCCCN[C@H]1CC(=C[C@@H](OC(CC)CC)[C@@H]1NC(C)=O)C(O)=O |r,c:7|
Show InChI InChI=1S/C18H32N2O4/c1-5-8-9-19-15-10-13(18(22)23)11-16(17(15)20-12(4)21)24-14(6-2)7-3/h11,14-17,19H,5-10H2,1-4H3,(H,20,21)(H,22,23)/t15-,16+,17+/m0/s1
n/an/a 19n/an/an/an/an/an/a
Shandong University
Curated by ChEMBL
Assay Description
Inhibition of Influenza A virus A/chicken/china/1220/2012(H5N1) Neuraminidase N1
J Med Chem 57: 8445-58 (2014)
Article DOI: 10.1021/jm500892k
BindingDB Entry DOI: 10.7270/Q2Z039QK
Neuraminidase
(Influenza A virus (strain A/USSR/90/1977 H1N1))
BDBM50028505
(CHEMBL3342468)
Show SMILES CCCCN[C@H]1CC(=C[C@@H](OC(CC)CC)[C@@H]1NC(C)=O)C(O)=O |r,c:7|
Show InChI InChI=1S/C18H32N2O4/c1-5-8-9-19-15-10-13(18(22)23)11-16(17(15)20-12(4)21)24-14(6-2)7-3/h11,14-17,19H,5-10H2,1-4H3,(H,20,21)(H,22,23)/t15-,16+,17+/m0/s1
n/an/a 630n/an/an/an/an/an/a
Shandong University
Curated by ChEMBL
Assay Description
Inhibition of Influenza A virus A/chicken/shandong/S2/02(H9N2) Neuraminidase
J Med Chem 57: 8445-58 (2014)
Article DOI: 10.1021/jm500892k
BindingDB Entry DOI: 10.7270/Q2Z039QK
Neuraminidase
(Influenza A virus (strain A/USSR/90/1977 H1N1))
BDBM50028505
(CHEMBL3342468)
Show SMILES CCCCN[C@H]1CC(=C[C@@H](OC(CC)CC)[C@@H]1NC(C)=O)C(O)=O |r,c:7|
Show InChI InChI=1S/C18H32N2O4/c1-5-8-9-19-15-10-13(18(22)23)11-16(17(15)20-12(4)21)24-14(6-2)7-3/h11,14-17,19H,5-10H2,1-4H3,(H,20,21)(H,22,23)/t15-,16+,17+/m0/s1
n/an/a 76n/an/an/an/an/an/a
Shandong University
Curated by ChEMBL
Assay Description
Inhibition of Influenza A virus A/duck/china/QJ/01(H5N1) Neuraminidase
J Med Chem 57: 8445-58 (2014)
Article DOI: 10.1021/jm500892k
BindingDB Entry DOI: 10.7270/Q2Z039QK
Neuraminidase
(Influenza A virus (strain A/USSR/90/1977 H1N1))
BDBM50028505
(CHEMBL3342468)
Show SMILES CCCCN[C@H]1CC(=C[C@@H](OC(CC)CC)[C@@H]1NC(C)=O)C(O)=O |r,c:7|
Show InChI InChI=1S/C18H32N2O4/c1-5-8-9-19-15-10-13(18(22)23)11-16(17(15)20-12(4)21)24-14(6-2)7-3/h11,14-17,19H,5-10H2,1-4H3,(H,20,21)(H,22,23)/t15-,16+,17+/m0/s1
n/an/a 56n/an/an/an/an/an/a
Shandong University
Curated by ChEMBL
Assay Description
Inhibition of Influenza A virus A/duck/china/1206/2012(H5N1) Neuraminidase
J Med Chem 57: 8445-58 (2014)
Article DOI: 10.1021/jm500892k
BindingDB Entry DOI: 10.7270/Q2Z039QK