BDBM50028512 CHEMBL3342475
SMILES: CCC(CC)O[C@@H]1C=C(C[C@H](NCc2ccccc2Br)[C@H]1NC(C)=O)C(O)=O
InChI Key: InChIKey=DVNHMULOEBCOQF-XUVXKRRUSA-N
Data: 4 IC50
Activity Spreadsheet -- Enzyme Inhibition Constant Data from BindingDB
Found 4 hits for monomerid = 50028512
Trg + Lig
Ki
nM
ΔG°
kcal/mole
IC50
nM
Kd
nM
EC50/IC50
nM
koff
s-1
kon
M-1s-1
pHTemp
°C
Neuraminidase
(Influenza A virus)
BDBM50028512
(CHEMBL3342475)
Show SMILES CCC(CC)O[C@@H]1C=C(C[C@H](NCc2ccccc2Br)[C@H]1NC(C)=O)C(O)=O |r,c:7|
Show InChI InChI=1S/C21H29BrN2O4/c1-4-16(5-2)28-19-11-15(21(26)27)10-18(20(19)24-13(3)25)23-12-14-8-6-7-9-17(14)22/h6-9,11,16,18-20,23H,4-5,10,12H2,1-3H3,(H,24,25)(H,26,27)/t18-,19+,20+/m0/s1
n/an/a 13n/an/an/an/an/an/a
Shandong University
Curated by ChEMBL
Assay Description
Inhibition of Influenza A virus A/chicken/china/1220/2012(H5N1) Neuraminidase N1
J Med Chem 57: 8445-58 (2014)
Article DOI: 10.1021/jm500892k
BindingDB Entry DOI: 10.7270/Q2Z039QK
Neuraminidase
(Influenza A virus (strain A/USSR/90/1977 H1N1))
BDBM50028512
(CHEMBL3342475)
Show SMILES CCC(CC)O[C@@H]1C=C(C[C@H](NCc2ccccc2Br)[C@H]1NC(C)=O)C(O)=O |r,c:7|
Show InChI InChI=1S/C21H29BrN2O4/c1-4-16(5-2)28-19-11-15(21(26)27)10-18(20(19)24-13(3)25)23-12-14-8-6-7-9-17(14)22/h6-9,11,16,18-20,23H,4-5,10,12H2,1-3H3,(H,24,25)(H,26,27)/t18-,19+,20+/m0/s1
n/an/a 42n/an/an/an/an/an/a
Shandong University
Curated by ChEMBL
Assay Description
Inhibition of Influenza A virus A/chicken/shandong/S2/02(H9N2) Neuraminidase
J Med Chem 57: 8445-58 (2014)
Article DOI: 10.1021/jm500892k
BindingDB Entry DOI: 10.7270/Q2Z039QK
Neuraminidase
(Influenza A virus (strain A/USSR/90/1977 H1N1))
BDBM50028512
(CHEMBL3342475)
Show SMILES CCC(CC)O[C@@H]1C=C(C[C@H](NCc2ccccc2Br)[C@H]1NC(C)=O)C(O)=O |r,c:7|
Show InChI InChI=1S/C21H29BrN2O4/c1-4-16(5-2)28-19-11-15(21(26)27)10-18(20(19)24-13(3)25)23-12-14-8-6-7-9-17(14)22/h6-9,11,16,18-20,23H,4-5,10,12H2,1-3H3,(H,24,25)(H,26,27)/t18-,19+,20+/m0/s1
n/an/a 56n/an/an/an/an/an/a
Shandong University
Curated by ChEMBL
Assay Description
Inhibition of Influenza A virus A/duck/china/QJ/01(H5N1) Neuraminidase
J Med Chem 57: 8445-58 (2014)
Article DOI: 10.1021/jm500892k
BindingDB Entry DOI: 10.7270/Q2Z039QK
Neuraminidase
(Influenza A virus (strain A/USSR/90/1977 H1N1))
BDBM50028512
(CHEMBL3342475)
Show SMILES CCC(CC)O[C@@H]1C=C(C[C@H](NCc2ccccc2Br)[C@H]1NC(C)=O)C(O)=O |r,c:7|
Show InChI InChI=1S/C21H29BrN2O4/c1-4-16(5-2)28-19-11-15(21(26)27)10-18(20(19)24-13(3)25)23-12-14-8-6-7-9-17(14)22/h6-9,11,16,18-20,23H,4-5,10,12H2,1-3H3,(H,24,25)(H,26,27)/t18-,19+,20+/m0/s1
n/an/a 38n/an/an/an/an/an/a
Shandong University
Curated by ChEMBL
Assay Description
Inhibition of Influenza A virus A/duck/china/1206/2012(H5N1) Neuraminidase
J Med Chem 57: 8445-58 (2014)
Article DOI: 10.1021/jm500892k
BindingDB Entry DOI: 10.7270/Q2Z039QK