BDBM50028796 2-Trimethylsilanyloxy-hexanenitrile::CHEMBL278436
SMILES: CCCCC(O[Si](C)(C)C)C#N
InChI Key: InChIKey=OEWHUOCJUPNDEC-UHFFFAOYSA-N
Data: 1 IC50
Activity Spreadsheet -- Enzyme Inhibition Constant Data from BindingDB
Found 1 hit for monomerid = 50028796
Trg + Lig
Ki
nM
ΔG°
kcal/mole
IC50
nM
Kd
nM
EC50/IC50
nM
koff
s-1
kon
M-1s-1
pHTemp
°C
Phenylethanolamine N-methyltransferase
(Bos taurus (bovine))
BDBM50028796
(2-Trimethylsilanyloxy-hexanenitrile | CHEMBL278436)
Show SMILES CCCCC(O[Si](C)(C)C)C#N
Show InChI InChI=1S/C9H19NOSi/c1-5-6-7-9(8-10)11-12(2,3)4/h9H,5-7H2,1-4H3
n/an/a 3.45E+5n/an/an/an/an/an/a
TBA
Curated by ChEMBL
Assay Description
Inhibitory activity against phenylethanolamine N-methyltransferase
J Med Chem 24: 7-12 (1981)
BindingDB Entry DOI: 10.7270/Q2PK0F59