BDBM50028801 CHEMBL18486::Cyclononanecarbaldehyde
SMILES: O=CC1CCCCCCCC1
InChI Key: InChIKey=MFLOBVLWSDCWSS-UHFFFAOYSA-N
Data: 1 IC50
Activity Spreadsheet -- Enzyme Inhibition Constant Data from BindingDB
Found 1 hit for monomerid = 50028801
Trg + Lig
Ki
nM
ΔG°
kcal/mole
IC50
nM
Kd
nM
EC50/IC50
nM
koff
s-1
kon
M-1s-1
pHTemp
°C
Phenylethanolamine N-methyltransferase
(Bos taurus (bovine))
BDBM50028801
(CHEMBL18486 | Cyclononanecarbaldehyde)
Show SMILES O=CC1CCCCCCCC1
Show InChI InChI=1S/C10H18O/c11-9-10-7-5-3-1-2-4-6-8-10/h9-10H,1-8H2
n/an/a 6.00E+3n/an/an/an/an/an/a
TBA
Curated by ChEMBL
Assay Description
Inhibitory activity against phenylethanolamine N-methyltransferase
J Med Chem 24: 7-12 (1981)
BindingDB Entry DOI: 10.7270/Q2PK0F59