BDBM50028813 1-Amino-nonan-2-ol::CHEMBL18384
SMILES: CCCCCCCC(O)CN
InChI Key: InChIKey=YOANQJMZPGJXJC-UHFFFAOYSA-N
Data: 1 IC50
Activity Spreadsheet -- Enzyme Inhibition Constant Data from BindingDB
Found 1 hit for monomerid = 50028813
Trg + Lig
Ki
nM
ΔG°
kcal/mole
IC50
nM
Kd
nM
EC50/IC50
nM
koff
s-1
kon
M-1s-1
pHTemp
°C
Phenylethanolamine N-methyltransferase
(Bos taurus (bovine))
BDBM50028813
(1-Amino-nonan-2-ol | CHEMBL18384)
Show SMILES CCCCCCCC(O)CN
Show InChI InChI=1S/C9H21NO/c1-2-3-4-5-6-7-9(11)8-10/h9,11H,2-8,10H2,1H3
n/an/a 2.16E+5n/an/an/an/an/an/a
TBA
Curated by ChEMBL
Assay Description
Inhibitory activity against phenylethanolamine N-methyltransferase
J Med Chem 24: 7-12 (1981)
BindingDB Entry DOI: 10.7270/Q2PK0F59