BDBM50028818 CHEMBL429219::Cyclopentyl-trimethylsilanyloxy-acetonitrile
SMILES: C[Si](C)(C)OC(C#N)C1CCCC1
InChI Key: InChIKey=CAKVWRDINPHARU-UHFFFAOYSA-N
Data: 1 IC50
Activity Spreadsheet -- Enzyme Inhibition Constant Data from BindingDB
Found 1 hit for monomerid = 50028818
Trg + Lig
Ki
nM
ΔG°
kcal/mole
IC50
nM
Kd
nM
EC50/IC50
nM
koff
s-1
kon
M-1s-1
pHTemp
°C
Phenylethanolamine N-methyltransferase
(Bos taurus (bovine))
BDBM50028818
(CHEMBL429219 | Cyclopentyl-trimethylsilanyloxy-ace...)
Show SMILES C[Si](C)(C)OC(C#N)C1CCCC1
Show InChI InChI=1S/C10H19NOSi/c1-13(2,3)12-10(8-11)9-6-4-5-7-9/h9-10H,4-7H2,1-3H3
n/an/a 4.46E+5n/an/an/an/an/an/a
TBA
Curated by ChEMBL
Assay Description
Inhibitory activity against phenylethanolamine N-methyltransferase
J Med Chem 24: 7-12 (1981)
BindingDB Entry DOI: 10.7270/Q2PK0F59