BDBM50028824 Aldehydes, C6::CHEMBL280331::HEXANAL
SMILES: CCCCCC=O
InChI Key: InChIKey=JARKCYVAAOWBJS-UHFFFAOYSA-N
Data: 2 IC50
Activity Spreadsheet -- Enzyme Inhibition Constant Data from BindingDB
Found 2 hits for monomerid = 50028824
Trg + Lig
Ki
nM
ΔG°
kcal/mole
IC50
nM
Kd
nM
EC50/IC50
nM
koff
s-1
kon
M-1s-1
pHTemp
°C
Phenylethanolamine N-methyltransferase
(Bos taurus (bovine))
BDBM50028824
(Aldehydes, C6 | CHEMBL280331 | HEXANAL)
Show SMILES CCCCCC=O
Show InChI InChI=1S/C6H12O/c1-2-3-4-5-6-7/h6H,2-5H2,1H3
n/an/a 3.14E+5n/an/an/an/an/an/a
TBA
Curated by ChEMBL
Assay Description
Inhibitory activity against phenylethanolamine N-methyltransferase
J Med Chem 24: 7-12 (1981)
BindingDB Entry DOI: 10.7270/Q2PK0F59
Olfactory receptor 17
(Rattus norvegicus (Rat))
BDBM50028824
(Aldehydes, C6 | CHEMBL280331 | HEXANAL)
Show SMILES CCCCCC=O
Show InChI InChI=1S/C6H12O/c1-2-3-4-5-6-7/h6H,2-5H2,1H3
n/an/a 1.33E+5n/an/an/an/an/an/a
Columbia University
Assay Description
Inhibition assay of olfactory receptors 17 activation.
Chem Biol 15: 1317-27 (2008)
Article DOI: 10.1016/j.chembiol.2008.10.014
BindingDB Entry DOI: 10.7270/Q21J9879