BDBM50028825 2-Amino-1-cyclopentyl-ethanol::CHEMBL18982
SMILES: NCC(O)C1CCCC1
InChI Key: InChIKey=CKKJQSVPBUAERO-UHFFFAOYSA-N
Data: 1 IC50
Activity Spreadsheet -- Enzyme Inhibition Constant Data from BindingDB
Found 1 hit for monomerid = 50028825
Trg + Lig
Ki
nM
ΔG°
kcal/mole
IC50
nM
Kd
nM
EC50/IC50
nM
koff
s-1
kon
M-1s-1
pHTemp
°C
Phenylethanolamine N-methyltransferase
(Bos taurus (bovine))
BDBM50028825
(2-Amino-1-cyclopentyl-ethanol | CHEMBL18982)
Show SMILES NCC(O)C1CCCC1
Show InChI InChI=1S/C7H15NO/c8-5-7(9)6-3-1-2-4-6/h6-7,9H,1-5,8H2
n/an/a 4.46E+5n/an/an/an/an/an/a
TBA
Curated by ChEMBL
Assay Description
Inhibitory activity against phenylethanolamine N-methyltransferase
J Med Chem 24: 7-12 (1981)
BindingDB Entry DOI: 10.7270/Q2PK0F59