BDBM50028846 CHEMBL279363::Cycloundecanecarbaldehyde
SMILES: O=CC1CCCCCCCCCC1
InChI Key: InChIKey=QXFKYWUVOXBSFV-UHFFFAOYSA-N
Data: 1 IC50
Activity Spreadsheet -- Enzyme Inhibition Constant Data from BindingDB
Found 1 hit for monomerid = 50028846
Trg + Lig
Ki
nM
ΔG°
kcal/mole
IC50
nM
Kd
nM
EC50/IC50
nM
koff
s-1
kon
M-1s-1
pHTemp
°C
Phenylethanolamine N-methyltransferase
(Bos taurus (bovine))
BDBM50028846
(CHEMBL279363 | Cycloundecanecarbaldehyde)
Show SMILES O=CC1CCCCCCCCCC1
Show InChI InChI=1S/C12H22O/c13-11-12-9-7-5-3-1-2-4-6-8-10-12/h11-12H,1-10H2
n/an/a 9.00E+3n/an/an/an/an/an/a
TBA
Curated by ChEMBL
Assay Description
Inhibitory activity against phenylethanolamine N-methyltransferase
J Med Chem 24: 7-12 (1981)
BindingDB Entry DOI: 10.7270/Q2PK0F59