BDBM50028865 CHEMBL3342706
SMILES: CC(C)C(=O)NCc1ccc(Cl)c(c1)-c1nc2cc(ccc2c(=O)[nH]1)C1CC1
InChI Key: InChIKey=KABAQGIJUOUDLP-UHFFFAOYSA-N
Data: 1 IC50
Activity Spreadsheet -- Enzyme Inhibition Constant Data from BindingDB
Found 1 hit for monomerid = 50028865
Trg + Lig
Ki
nM
ΔG°
kcal/mole
IC50
nM
Kd
nM
EC50/IC50
nM
koff
s-1
kon
M-1s-1
pHTemp
°C
Prostaglandin E synthase
(Homo sapiens (Human))
BDBM50028865
(CHEMBL3342706)
Show SMILES CC(C)C(=O)NCc1ccc(Cl)c(c1)-c1nc2cc(ccc2c(=O)[nH]1)C1CC1
Show InChI InChI=1S/C22H22ClN3O2/c1-12(2)21(27)24-11-13-3-8-18(23)17(9-13)20-25-19-10-15(14-4-5-14)6-7-16(19)22(28)26-20/h3,6-10,12,14H,4-5,11H2,1-2H3,(H,24,27)(H,25,26,28)
Reactome pathway
n/an/a 58n/an/an/an/an/an/a
Glenmark Pharmaceuticals Limited
Curated by ChEMBL
Assay Description
Inhibition of human recombinant mPGES-1 expressed in CHO cells using PGH2 as substrate incubated for 10 mins prior to substrate addition measured aft...
Bioorg Med Chem Lett 24: 4838-44 (2014)
Article DOI: 10.1016/j.bmcl.2014.08.056
BindingDB Entry DOI: 10.7270/Q2X068MN