BDBM50028934 CHEMBL1412666
SMILES: [O-][N+](=O)c1cc(Cl)ccc1Sc1ccccn1
InChI Key: InChIKey=HQYNUUOLXDFUHF-UHFFFAOYSA-N
Data: 1 IC50
Activity Spreadsheet -- Enzyme Inhibition Constant Data from BindingDB
Found 1 hit for monomerid = 50028934
Trg + Lig
Ki
nM
ΔG°
kcal/mole
IC50
nM
Kd
nM
EC50/IC50
nM
koff
s-1
kon
M-1s-1
pHTemp
°C
Phosphodiesterase 7
(Homo sapiens (Human))
BDBM50028934
(CHEMBL1412666)
Show SMILES [O-][N+](=O)c1cc(Cl)ccc1Sc1ccccn1
Show InChI InChI=1S/C11H7ClN2O2S/c12-8-4-5-10(9(7-8)14(15)16)17-11-3-1-2-6-13-11/h1-7H
Reactome pathway
n/an/a 3.60E+3n/an/an/an/an/an/a
Centro de Investigaciones Biol�gicas (CSIC)
Curated by ChEMBL
Assay Description
Inhibition of human recombinant PDE7A1 assessed as inhibition of hydrolysis of [3H]cAMP after 20 mins by scintillation proximity assay
J Med Chem 57: 8590-607 (2014)
Article DOI: 10.1021/jm501090m
BindingDB Entry DOI: 10.7270/Q2S75HXC