null
SMILES: CC(C)NCCCOc1ccccc1Cc1ccccc1
InChI Key: InChIKey=SDXCOFMADDLLKC-UHFFFAOYSA-N
Activity Spreadsheet -- Enzyme Inhibition Constant Data from BindingDB
Found 1 hit for monomerid = 50029172
Trg + Lig
Ki
nM
ΔG°
kcal/mole
IC50
nM
Kd
nM
EC50/IC50
nM
koff
s-1
kon
M-1s-1
pHTemp
°C
Squalene synthase
(Rattus norvegicus)
BDBM50029172
(CHEMBL131930 | [3-(2-Benzyl-phenoxy)-propyl]-isopr...)
Show SMILES CC(C)NCCCOc1ccccc1Cc1ccccc1
Show InChI InChI=1S/C19H25NO/c1-16(2)20-13-8-14-21-19-12-7-6-11-18(19)15-17-9-4-3-5-10-17/h3-7,9-12,16,20H,8,13-15H2,1-2H3
Reactome pathway
n/an/a 12n/an/an/an/an/an/a
Zeneca Pharmaceuticals
Curated by ChEMBL
Assay Description
Inhibition of rat microsomal squalene synthase
J Med Chem 38: 4157-60 (1995)
BindingDB Entry DOI: 10.7270/Q21V5D0D