BDBM50029684 CHEMBL3353403
SMILES: COc1cc(N2CC[C@H](C2)N(C)C)c(NC(=O)C=C)cc1Nc1ncc(Cl)c(n1)-c1cnn2ccccc12
InChI Key: InChIKey=NBRHHKSETRXRCP-QGZVFWFLSA-N
Data: 6 IC50
Activity Spreadsheet -- Enzyme Inhibition Constant Data from BindingDB
Found 6 hits for monomerid = 50029684
Trg + Lig
Ki
nM
ΔG°
kcal/mole
IC50
nM
Kd
nM
EC50/IC50
nM
koff
s-1
kon
M-1s-1
pHTemp
°C
Epidermal growth factor receptor
(Homo sapiens (Human))
BDBM50029684
(CHEMBL3353403)
Show SMILES COc1cc(N2CC[C@H](C2)N(C)C)c(NC(=O)C=C)cc1Nc1ncc(Cl)c(n1)-c1cnn2ccccc12 |r|
Show InChI InChI=1S/C27H29ClN8O2/c1-5-25(37)31-20-12-21(24(38-4)13-23(20)35-11-9-17(16-35)34(2)3)32-27-29-15-19(28)26(33-27)18-14-30-36-10-7-6-8-22(18)36/h5-8,10,12-15,17H,1,9,11,16H2,2-4H3,(H,31,37)(H,29,32,33)/t17-/m1/s1
n/an/a 2.00E+3n/an/an/an/an/an/a
AstraZeneca
Curated by ChEMBL
Assay Description
Inhibition of EGFR L858R/T970M double mutant phosphorylation in human NCI-H1975 cells after 2 hrs by fluorescence assay
J Med Chem 57: 8249-67 (2014)
Article DOI: 10.1021/jm500973a
BindingDB Entry DOI: 10.7270/Q2ZS2Z4C
Epidermal growth factor receptor
(Homo sapiens (Human))
BDBM50029684
(CHEMBL3353403)
Show SMILES COc1cc(N2CC[C@H](C2)N(C)C)c(NC(=O)C=C)cc1Nc1ncc(Cl)c(n1)-c1cnn2ccccc12 |r|
Show InChI InChI=1S/C27H29ClN8O2/c1-5-25(37)31-20-12-21(24(38-4)13-23(20)35-11-9-17(16-35)34(2)3)32-27-29-15-19(28)26(33-27)18-14-30-36-10-7-6-8-22(18)36/h5-8,10,12-15,17H,1,9,11,16H2,2-4H3,(H,31,37)(H,29,32,33)/t17-/m1/s1
n/an/a 1.60E+4n/an/an/an/an/an/a
AstraZeneca
Curated by ChEMBL
Assay Description
Inhibition of EGFR exon 19 deletion activating mutant phosphorylation in human PC9 cells after 2 hrs by fluorescence assay
J Med Chem 57: 8249-67 (2014)
Article DOI: 10.1021/jm500973a
BindingDB Entry DOI: 10.7270/Q2ZS2Z4C
Insulin receptor
(Homo sapiens (Human))
BDBM50029684
(CHEMBL3353403)
Show SMILES COc1cc(N2CC[C@H](C2)N(C)C)c(NC(=O)C=C)cc1Nc1ncc(Cl)c(n1)-c1cnn2ccccc12 |r|
Show InChI InChI=1S/C27H29ClN8O2/c1-5-25(37)31-20-12-21(24(38-4)13-23(20)35-11-9-17(16-35)34(2)3)32-27-29-15-19(28)26(33-27)18-14-30-36-10-7-6-8-22(18)36/h5-8,10,12-15,17H,1,9,11,16H2,2-4H3,(H,31,37)(H,29,32,33)/t17-/m1/s1
n/an/a 21n/an/an/an/an/an/a
AstraZeneca
Curated by ChEMBL
Assay Description
Inhibition of INSR (unknown origin)
J Med Chem 57: 8249-67 (2014)
Article DOI: 10.1021/jm500973a
BindingDB Entry DOI: 10.7270/Q2ZS2Z4C
Potassium voltage-gated channel subfamily H member 2
(Homo sapiens (Human))
BDBM50029684
(CHEMBL3353403)
Show SMILES COc1cc(N2CC[C@H](C2)N(C)C)c(NC(=O)C=C)cc1Nc1ncc(Cl)c(n1)-c1cnn2ccccc12 |r|
Show InChI InChI=1S/C27H29ClN8O2/c1-5-25(37)31-20-12-21(24(38-4)13-23(20)35-11-9-17(16-35)34(2)3)32-27-29-15-19(28)26(33-27)18-14-30-36-10-7-6-8-22(18)36/h5-8,10,12-15,17H,1,9,11,16H2,2-4H3,(H,31,37)(H,29,32,33)/t17-/m1/s1
Reactome pathway
n/an/a 5.60E+3n/an/an/an/an/an/a
AstraZeneca
Curated by ChEMBL
Assay Description
Inhibition of human ERG
J Med Chem 57: 8249-67 (2014)
Article DOI: 10.1021/jm500973a
BindingDB Entry DOI: 10.7270/Q2ZS2Z4C
Insulin-like growth factor I receptor
(Homo sapiens (Human))
BDBM50029684
(CHEMBL3353403)
Show SMILES COc1cc(N2CC[C@H](C2)N(C)C)c(NC(=O)C=C)cc1Nc1ncc(Cl)c(n1)-c1cnn2ccccc12 |r|
Show InChI InChI=1S/C27H29ClN8O2/c1-5-25(37)31-20-12-21(24(38-4)13-23(20)35-11-9-17(16-35)34(2)3)32-27-29-15-19(28)26(33-27)18-14-30-36-10-7-6-8-22(18)36/h5-8,10,12-15,17H,1,9,11,16H2,2-4H3,(H,31,37)(H,29,32,33)/t17-/m1/s1
Reactome pathway
n/an/a 7n/an/an/an/an/an/a
AstraZeneca
Curated by ChEMBL
Assay Description
Inhibition of IGF1R (unknown origin)
J Med Chem 57: 8249-67 (2014)
Article DOI: 10.1021/jm500973a
BindingDB Entry DOI: 10.7270/Q2ZS2Z4C
Epidermal growth factor receptor
(Homo sapiens (Human))
BDBM50029684
(CHEMBL3353403)
Show SMILES COc1cc(N2CC[C@H](C2)N(C)C)c(NC(=O)C=C)cc1Nc1ncc(Cl)c(n1)-c1cnn2ccccc12 |r|
Show InChI InChI=1S/C27H29ClN8O2/c1-5-25(37)31-20-12-21(24(38-4)13-23(20)35-11-9-17(16-35)34(2)3)32-27-29-15-19(28)26(33-27)18-14-30-36-10-7-6-8-22(18)36/h5-8,10,12-15,17H,1,9,11,16H2,2-4H3,(H,31,37)(H,29,32,33)/t17-/m1/s1
n/an/a 3.57E+5n/an/an/an/an/an/a
AstraZeneca
Curated by ChEMBL
Assay Description
Inhibition of wild type EGFR phosphorylation in human LoVo cells after 2 hrs by fluorescence assay
J Med Chem 57: 8249-67 (2014)
Article DOI: 10.1021/jm500973a
BindingDB Entry DOI: 10.7270/Q2ZS2Z4C