BDBM50029702 3-Chloro-2-(4-isopropyl-1,1,3-trioxo-1,3-dihydro-1lambda*6*-benzo[d]isothiazol-2-ylmethoxy)-pyrido[1,2-a]pyrimidin-4-one::CHEMBL356732
SMILES: CC(C)c1cccc2c1C(=O)N(COc1nc3ccccn3c(=O)c1Cl)S2(=O)=O
InChI Key: InChIKey=IZOGWZMDGOQIKF-UHFFFAOYSA-N
Data: 1 KI  1 Kon
Activity Spreadsheet -- Enzyme Inhibition Constant Data from BindingDB
Found 2 hits for monomerid = 50029702
Trg + Lig
Ki
nM
ΔG°
kcal/mole
IC50
nM
Kd
nM
EC50/IC50
nM
koff
s-1
kon
M-1s-1
pHTemp
°C
Neutrophil elastase
(Homo sapiens (Human))
BDBM50029702
(3-Chloro-2-(4-isopropyl-1,1,3-trioxo-1,3-dihydro-1...)
Show SMILES CC(C)c1cccc2c1C(=O)N(COc1nc3ccccn3c(=O)c1Cl)S2(=O)=O
Show InChI InChI=1S/C19H16ClN3O5S/c1-11(2)12-6-5-7-13-15(12)18(24)23(29(13,26)27)10-28-17-16(20)19(25)22-9-4-3-8-14(22)21-17/h3-9,11H,10H2,1-2H3
Reactome pathway
0.210n/an/an/an/an/an/an/an/a
Sterling Winthrop Pharmaceuticals Research Division
Curated by ChEMBL
Assay Description
Potency of inhibition of human leukocyte elastase is expressed as apparent binding constant
J Med Chem 38: 4687-92 (1995)
BindingDB Entry DOI: 10.7270/Q2KP816X
Neutrophil elastase
(Homo sapiens (Human))
BDBM50029702
(3-Chloro-2-(4-isopropyl-1,1,3-trioxo-1,3-dihydro-1...)
Show SMILES CC(C)c1cccc2c1C(=O)N(COc1nc3ccccn3c(=O)c1Cl)S2(=O)=O
Show InChI InChI=1S/C19H16ClN3O5S/c1-11(2)12-6-5-7-13-15(12)18(24)23(29(13,26)27)10-28-17-16(20)19(25)22-9-4-3-8-14(22)21-17/h3-9,11H,10H2,1-2H3
Reactome pathway
n/an/an/an/an/an/a 4.30E+4n/an/a
Sterling Winthrop Pharmaceuticals Research Division
Curated by ChEMBL
Assay Description
Potency of inhibition of human leukocyte elastase is expressed as apparent binding constant
J Med Chem 38: 4687-92 (1995)
BindingDB Entry DOI: 10.7270/Q2KP816X