BDBM50029982 12-Hydroxy-6,6,10,11-tetramethyl-4-phenyl-11,12-dihydro-6H,10H-dipyrano[2,3-f;2',3'-h]chromen-2-one::CHEMBL337029
SMILES: C[C@H]1Oc2c3C=CC(C)(C)Oc3c3c(cc(=O)oc3c2[C@@H](O)[C@@H]1C)-c1ccccc1
InChI Key: InChIKey=BXENDTPSKAICGV-LKBUQDJMSA-N
Data: 3 IC50  1 EC50
Activity Spreadsheet -- Enzyme Inhibition Constant Data from BindingDB
Found 4 hits for monomerid = 50029982
Trg + Lig
Ki
nM
ΔG°
kcal/mole
IC50
nM
Kd
nM
EC50/IC50
nM
koff
s-1
kon
M-1s-1
pHTemp
°C
Human immunodeficiency virus type 1 reverse transcriptase
(Human immunodeficiency virus 1)
BDBM50029982
(12-Hydroxy-6,6,10,11-tetramethyl-4-phenyl-11,12-di...)
Show SMILES C[C@H]1Oc2c3C=CC(C)(C)Oc3c3c(cc(=O)oc3c2[C@@H](O)[C@@H]1C)-c1ccccc1 |c:5|
Show InChI InChI=1S/C25H24O5/c1-13-14(2)28-22-16-10-11-25(3,4)30-23(16)19-17(15-8-6-5-7-9-15)12-18(26)29-24(19)20(22)21(13)27/h5-14,21,27H,1-4H3/t13-,14-,21+/m1/s1
n/an/a 160n/an/an/an/an/an/a
SmithKline Beecham Pharmaceuticals R& D
Curated by ChEMBL
Assay Description
Inhibitory concentration against HIV-1 reverse transcriptase mutant (Tyr-181 to Cys)
J Med Chem 36: 4131-8 (1994)
BindingDB Entry DOI: 10.7270/Q269746K
Reverse transcriptase
(Human immunodeficiency virus 1)
BDBM50029982
(12-Hydroxy-6,6,10,11-tetramethyl-4-phenyl-11,12-di...)
Show SMILES C[C@H]1Oc2c3C=CC(C)(C)Oc3c3c(cc(=O)oc3c2[C@@H](O)[C@@H]1C)-c1ccccc1 |c:5|
Show InChI InChI=1S/C25H24O5/c1-13-14(2)28-22-16-10-11-25(3,4)30-23(16)19-17(15-8-6-5-7-9-15)12-18(26)29-24(19)20(22)21(13)27/h5-14,21,27H,1-4H3/t13-,14-,21+/m1/s1
n/an/an/an/a 225n/an/an/an/a
Solapur University
Curated by ChEMBL
Assay Description
Inhibition of recombinant HIV-1 reverse transcriptase RNA-dependent DNA polymerase activity using poly(rA)/oligo(dT)16 as template/primer preincubate...
Eur J Med Chem 157: 310-319 (2018)
Article DOI: 10.1016/j.ejmech.2018.07.067
BindingDB Entry DOI: 10.7270/Q2251MXW
Human immunodeficiency virus type 1 reverse transcriptase
(Human immunodeficiency virus 1)
BDBM50029982
(12-Hydroxy-6,6,10,11-tetramethyl-4-phenyl-11,12-di...)
Show SMILES C[C@H]1Oc2c3C=CC(C)(C)Oc3c3c(cc(=O)oc3c2[C@@H](O)[C@@H]1C)-c1ccccc1 |c:5|
Show InChI InChI=1S/C25H24O5/c1-13-14(2)28-22-16-10-11-25(3,4)30-23(16)19-17(15-8-6-5-7-9-15)12-18(26)29-24(19)20(22)21(13)27/h5-14,21,27H,1-4H3/t13-,14-,21+/m1/s1
n/an/a 160n/an/an/an/an/an/a
SmithKline Beecham Pharmaceuticals R& D
Curated by ChEMBL
Assay Description
Inhibitory concentration against HIV-1 reverse transcriptase mutant (Tyr-181 to Cys)
J Med Chem 36: 4131-8 (1994)
BindingDB Entry DOI: 10.7270/Q269746K
Human immunodeficiency virus type 1 reverse transcriptase
(Human immunodeficiency virus 1)
BDBM50029982
(12-Hydroxy-6,6,10,11-tetramethyl-4-phenyl-11,12-di...)
Show SMILES C[C@H]1Oc2c3C=CC(C)(C)Oc3c3c(cc(=O)oc3c2[C@@H](O)[C@@H]1C)-c1ccccc1 |c:5|
Show InChI InChI=1S/C25H24O5/c1-13-14(2)28-22-16-10-11-25(3,4)30-23(16)19-17(15-8-6-5-7-9-15)12-18(26)29-24(19)20(22)21(13)27/h5-14,21,27H,1-4H3/t13-,14-,21+/m1/s1
n/an/a 410n/an/an/an/an/an/a
SmithKline Beecham Pharmaceuticals R& D
Curated by ChEMBL
Assay Description
Inhibitory concentration against HIV-1 reverse transcriptase mutant (Tyr-181 to Leu)
J Med Chem 36: 4131-8 (1994)
BindingDB Entry DOI: 10.7270/Q269746K