BDBM50029986 12-(4-Bromo-benzoyl)-6,6,10,11-tetramethyl-4-phenyl-11,12-dihydro-6H,10H-dipyrano[2,3-f;2',3'-h]chromen-2-one::CHEMBL334861
SMILES: C[C@H]1Oc2c3C=CC(C)(C)Oc3c3c(cc(=O)oc3c2[C@H]([C@H]1C)C(=O)c1ccc(Br)cc1)-c1ccccc1
InChI Key: InChIKey=DQVQZUBFENXUBC-ATLLOTDBSA-N
Data: 1 IC50
Activity Spreadsheet -- Enzyme Inhibition Constant Data from BindingDB
Found 1 hit for monomerid = 50029986
Trg + Lig
Ki
nM
ΔG°
kcal/mole
IC50
nM
Kd
nM
EC50/IC50
nM
koff
s-1
kon
M-1s-1
pHTemp
°C
Reverse transcriptase/RNaseH
(Human immunodeficiency virus 1)
BDBM50029986
(12-(4-Bromo-benzoyl)-6,6,10,11-tetramethyl-4-pheny...)
Show SMILES C[C@H]1Oc2c3C=CC(C)(C)Oc3c3c(cc(=O)oc3c2[C@H]([C@H]1C)C(=O)c1ccc(Br)cc1)-c1ccccc1 |c:5|
Show InChI InChI=1S/C32H27BrO5/c1-17-18(2)36-29-22-14-15-32(3,4)38-30(22)26-23(19-8-6-5-7-9-19)16-24(34)37-31(26)27(29)25(17)28(35)20-10-12-21(33)13-11-20/h5-18,25H,1-4H3/t17-,18+,25-/m0/s1
n/an/a 4.60E+4n/an/an/an/an/an/a
SmithKline Beecham Pharmaceuticals R& D
Curated by ChEMBL
Assay Description
Inhibitory concentration against HIV-1 reverse transcriptase in scintillation proximity assay
J Med Chem 36: 4131-8 (1994)
BindingDB Entry DOI: 10.7270/Q269746K