BDBM50030344 (R)-2-{(S)-2-[(R)-2-tert-Butoxycarbonylamino-3-(4-hydroxy-phenyl)-propionylamino]-3-phenyl-propionylamino}-3-mercapto-propionic acid::CHEMBL139234
SMILES: CC(C)(C)OC(=O)N[C@H](Cc1ccc(O)cc1)C(=O)N[C@@H](Cc1ccccc1)C(=O)N[C@@H](CS)C(O)=O
InChI Key: InChIKey=YSNFTNHTIDTYQW-HBMCJLEFSA-N
Data: 1 IC50
Activity Spreadsheet -- Enzyme Inhibition Constant Data from BindingDB
Found 1 hit for monomerid = 50030344
Trg + Lig
Ki
nM
ΔG°
kcal/mole
IC50
nM
Kd
nM
EC50/IC50
nM
koff
s-1
kon
M-1s-1
pHTemp
°C
Peptidyl-glycine alpha-amidating monooxygenase
(Rattus norvegicus)
BDBM50030344
((R)-2-{(S)-2-[(R)-2-tert-Butoxycarbonylamino-3-(4-...)
Show SMILES CC(C)(C)OC(=O)N[C@H](Cc1ccc(O)cc1)C(=O)N[C@@H](Cc1ccccc1)C(=O)N[C@@H](CS)C(O)=O
Show InChI InChI=1S/C26H33N3O7S/c1-26(2,3)36-25(35)29-20(14-17-9-11-18(30)12-10-17)23(32)27-19(13-16-7-5-4-6-8-16)22(31)28-21(15-37)24(33)34/h4-12,19-21,30,37H,13-15H2,1-3H3,(H,27,32)(H,28,31)(H,29,35)(H,33,34)/t19-,20+,21-/m0/s1
n/an/a 340n/an/an/an/an/an/a
CIBA-GEIGY Corporation
Curated by ChEMBL
Assay Description
Inhibitory activity against peptidylglycine alpha-amidating monooxygenase (PAM) was determined
J Med Chem 37: 4430-7 (1995)
BindingDB Entry DOI: 10.7270/Q20R9NF9