BDBM50030361 CHEMBL344255::{(S)-2-[(R)-2-Benzyloxycarbonylamino-3-(4-hydroxy-phenyl)-propionylamino]-3-phenyl-propionylamino}-acetic acid
SMILES: OC(=O)CNC(=O)[C@H](Cc1ccccc1)NC(=O)[C@@H](Cc1ccc(O)cc1)NC(=O)OCc1ccccc1
InChI Key: InChIKey=LJXUGKUOVQPRET-BJKOFHAPSA-N
Data: 1 IC50
Activity Spreadsheet -- Enzyme Inhibition Constant Data from BindingDB
Found 1 hit for monomerid = 50030361
Trg + Lig
Ki
nM
ΔG°
kcal/mole
IC50
nM
Kd
nM
EC50/IC50
nM
koff
s-1
kon
M-1s-1
pHTemp
°C
Peptidyl-glycine alpha-amidating monooxygenase
(Rattus norvegicus)
BDBM50030361
(CHEMBL344255 | {(S)-2-[(R)-2-Benzyloxycarbonylamin...)
Show SMILES OC(=O)CNC(=O)[C@H](Cc1ccccc1)NC(=O)[C@@H](Cc1ccc(O)cc1)NC(=O)OCc1ccccc1
Show InChI InChI=1S/C28H29N3O7/c32-22-13-11-20(12-14-22)16-24(31-28(37)38-18-21-9-5-2-6-10-21)27(36)30-23(26(35)29-17-25(33)34)15-19-7-3-1-4-8-19/h1-14,23-24,32H,15-18H2,(H,29,35)(H,30,36)(H,31,37)(H,33,34)/t23-,24+/m0/s1
n/an/a 3.50E+3n/an/an/an/an/an/a
CIBA-GEIGY Corporation
Curated by ChEMBL
Assay Description
Inhibitory activity against peptidylglycine alpha-amidating monooxygenase (PAM) was determined
J Med Chem 37: 4430-7 (1995)
BindingDB Entry DOI: 10.7270/Q20R9NF9