BDBM50030685 CHEMBL338888::Pentanoic acid {4-chloro-3-[3-ethyl-4-(3-fluoro-2'-(N-t-butyloxycarbonyl)-Sulfanamido-biphenyl-4-ylmethyl)-5-oxo-4,5-dihydro-[1,2,4]triazol-1-yl]-phenyl}-amide
SMILES: CCCCC(=O)Nc1ccc(Cl)c(c1)-n1nc(CC)n(Cc2ccc(cc2F)-c2ccccc2S(=O)(=O)NC(=O)OC(C)(C)C)c1=O
InChI Key: InChIKey=CRJVMNPCUAKZTC-UHFFFAOYSA-N
Data: 7 IC50
Activity Spreadsheet -- Enzyme Inhibition Constant Data from BindingDB
Found 7 hits for monomerid = 50030685
Trg + Lig
Ki
nM
ΔG°
kcal/mole
IC50
nM
Kd
nM
EC50/IC50
nM
koff
s-1
kon
M-1s-1
pHTemp
°C
Angiotensin II type 1a (AT-1a) receptor
(RABBIT)
BDBM50030685
(CHEMBL338888 | Pentanoic acid {4-chloro-3-[3-ethyl...)
Show SMILES CCCCC(=O)Nc1ccc(Cl)c(c1)-n1nc(CC)n(Cc2ccc(cc2F)-c2ccccc2S(=O)(=O)NC(=O)OC(C)(C)C)c1=O
Show InChI InChI=1S/C33H37ClFN5O6S/c1-6-8-13-30(41)36-23-16-17-25(34)27(19-23)40-32(43)39(29(7-2)37-40)20-22-15-14-21(18-26(22)35)24-11-9-10-12-28(24)47(44,45)38-31(42)46-33(3,4)5/h9-12,14-19H,6-8,13,20H2,1-5H3,(H,36,41)(H,38,42)
n/an/a 0.510n/an/an/an/an/an/a
Merck Research Laboratories
Curated by ChEMBL
Assay Description
In vitro inhibitory activity against Angiotensin II receptor, type 1 in rabbit aorta membrane preparations.
J Med Chem 38: 3741-58 (1995)
BindingDB Entry DOI: 10.7270/Q2Q81C35
Angiotensin II AT2
(RAT)
BDBM50030685
(CHEMBL338888 | Pentanoic acid {4-chloro-3-[3-ethyl...)
Show SMILES CCCCC(=O)Nc1ccc(Cl)c(c1)-n1nc(CC)n(Cc2ccc(cc2F)-c2ccccc2S(=O)(=O)NC(=O)OC(C)(C)C)c1=O
Show InChI InChI=1S/C33H37ClFN5O6S/c1-6-8-13-30(41)36-23-16-17-25(34)27(19-23)40-32(43)39(29(7-2)37-40)20-22-15-14-21(18-26(22)35)24-11-9-10-12-28(24)47(44,45)38-31(42)46-33(3,4)5/h9-12,14-19H,6-8,13,20H2,1-5H3,(H,36,41)(H,38,42)
n/an/a 0.0700n/an/an/an/an/an/a
Merck Research Laboratories
Curated by ChEMBL
Assay Description
In vitro inhibitory activity against angiotensin II type 2 receptor in rat adrenal membrane preparations.
J Med Chem 38: 3741-58 (1995)
BindingDB Entry DOI: 10.7270/Q2Q81C35
Angiotensin II receptor
(Homo sapiens (Human))
BDBM50030685
(CHEMBL338888 | Pentanoic acid {4-chloro-3-[3-ethyl...)
Show SMILES CCCCC(=O)Nc1ccc(Cl)c(c1)-n1nc(CC)n(Cc2ccc(cc2F)-c2ccccc2S(=O)(=O)NC(=O)OC(C)(C)C)c1=O
Show InChI InChI=1S/C33H37ClFN5O6S/c1-6-8-13-30(41)36-23-16-17-25(34)27(19-23)40-32(43)39(29(7-2)37-40)20-22-15-14-21(18-26(22)35)24-11-9-10-12-28(24)47(44,45)38-31(42)46-33(3,4)5/h9-12,14-19H,6-8,13,20H2,1-5H3,(H,36,41)(H,38,42)
n/an/a 2n/an/an/an/an/an/a
Merck Research Laboratories
Curated by ChEMBL
Assay Description
In vitro inhibitory activity against Angiotensin II receptor type 2 in human adrenal membrane preparations.
J Med Chem 38: 3741-58 (1995)
BindingDB Entry DOI: 10.7270/Q2Q81C35
Angiotensin II type 1a (AT-1a) receptor
(RABBIT)
BDBM50030685
(CHEMBL338888 | Pentanoic acid {4-chloro-3-[3-ethyl...)
Show SMILES CCCCC(=O)Nc1ccc(Cl)c(c1)-n1nc(CC)n(Cc2ccc(cc2F)-c2ccccc2S(=O)(=O)NC(=O)OC(C)(C)C)c1=O
Show InChI InChI=1S/C33H37ClFN5O6S/c1-6-8-13-30(41)36-23-16-17-25(34)27(19-23)40-32(43)39(29(7-2)37-40)20-22-15-14-21(18-26(22)35)24-11-9-10-12-28(24)47(44,45)38-31(42)46-33(3,4)5/h9-12,14-19H,6-8,13,20H2,1-5H3,(H,36,41)(H,38,42)
n/an/a 0.511n/an/an/an/an/an/a
TBA
Assay Description
Antagonist activity at Oryctolagus cuniculus (rabbit) aortic AT1 receptor
Citation and Details
Article DOI: 10.1007/s00044-011-9815-x
BindingDB Entry DOI: 10.7270/Q2VT1W0S
Angiotensin II receptor
(Homo sapiens (Human))
BDBM50030685
(CHEMBL338888 | Pentanoic acid {4-chloro-3-[3-ethyl...)
Show SMILES CCCCC(=O)Nc1ccc(Cl)c(c1)-n1nc(CC)n(Cc2ccc(cc2F)-c2ccccc2S(=O)(=O)NC(=O)OC(C)(C)C)c1=O
Show InChI InChI=1S/C33H37ClFN5O6S/c1-6-8-13-30(41)36-23-16-17-25(34)27(19-23)40-32(43)39(29(7-2)37-40)20-22-15-14-21(18-26(22)35)24-11-9-10-12-28(24)47(44,45)38-31(42)46-33(3,4)5/h9-12,14-19H,6-8,13,20H2,1-5H3,(H,36,41)(H,38,42)
Reactome pathway
n/an/a 0.510n/an/an/an/an/an/a
Merck Research Laboratories
Curated by ChEMBL
Assay Description
In vitro inhibitory activity against Angiotensin II receptor, type 1 in rabbit aorta membrane preparations.
J Med Chem 38: 3741-58 (1995)
BindingDB Entry DOI: 10.7270/Q2Q81C35
Angiotensin II type 1a (AT-1a) receptor
(RABBIT)
BDBM50030685
(CHEMBL338888 | Pentanoic acid {4-chloro-3-[3-ethyl...)
Show SMILES CCCCC(=O)Nc1ccc(Cl)c(c1)-n1nc(CC)n(Cc2ccc(cc2F)-c2ccccc2S(=O)(=O)NC(=O)OC(C)(C)C)c1=O
Show InChI InChI=1S/C33H37ClFN5O6S/c1-6-8-13-30(41)36-23-16-17-25(34)27(19-23)40-32(43)39(29(7-2)37-40)20-22-15-14-21(18-26(22)35)24-11-9-10-12-28(24)47(44,45)38-31(42)46-33(3,4)5/h9-12,14-19H,6-8,13,20H2,1-5H3,(H,36,41)(H,38,42)
n/an/a 0.510n/an/an/an/an/an/a
TBA
Assay Description
Antagonist activity at Oryctolagus cuniculus (rabbit) aortic AT1 receptor
Citation and Details
Article DOI: 10.1007/s00044-011-9815-x
BindingDB Entry DOI: 10.7270/Q2VT1W0S
Angiotensin II AT2
(RAT)
BDBM50030685
(CHEMBL338888 | Pentanoic acid {4-chloro-3-[3-ethyl...)
Show SMILES CCCCC(=O)Nc1ccc(Cl)c(c1)-n1nc(CC)n(Cc2ccc(cc2F)-c2ccccc2S(=O)(=O)NC(=O)OC(C)(C)C)c1=O
Show InChI InChI=1S/C33H37ClFN5O6S/c1-6-8-13-30(41)36-23-16-17-25(34)27(19-23)40-32(43)39(29(7-2)37-40)20-22-15-14-21(18-26(22)35)24-11-9-10-12-28(24)47(44,45)38-31(42)46-33(3,4)5/h9-12,14-19H,6-8,13,20H2,1-5H3,(H,36,41)(H,38,42)
n/an/a 0.280n/an/an/an/an/an/a
Merck Research Laboratories
Curated by ChEMBL
Assay Description
In vitro inhibitory activity against Angiotensin II receptor, type 2 in rat midbrain membrane preparations.
J Med Chem 38: 3741-58 (1995)
BindingDB Entry DOI: 10.7270/Q2Q81C35