BDBM50030781 CHEMBL3342372
SMILES: Cc1nc(NCc2ccc(Cl)cc2)cc(n1)-c1ccccn1
InChI Key: InChIKey=GRILMLILBQPHHQ-UHFFFAOYSA-N
Data: 2 EC50
Activity Spreadsheet -- Enzyme Inhibition Constant Data from BindingDB
Found 2 hits for monomerid = 50030781
Trg + Lig
Ki
nM
ΔG°
kcal/mole
IC50
nM
Kd
nM
EC50/IC50
nM
koff
s-1
kon
M-1s-1
pHTemp
°C
G-protein coupled receptor 39
(Mus musculus)
BDBM50030781
(CHEMBL3342372)
Show SMILES Cc1nc(NCc2ccc(Cl)cc2)cc(n1)-c1ccccn1
Show InChI InChI=1S/C17H15ClN4/c1-12-21-16(15-4-2-3-9-19-15)10-17(22-12)20-11-13-5-7-14(18)8-6-13/h2-10H,11H2,1H3,(H,20,21,22)
n/an/an/an/a 17n/an/an/an/a
Novartis Institutes for BioMedical Research
Curated by ChEMBL
Assay Description
Agonist activity at mouse GPR39 expressed in HEK293 cells by IP1 assay
ACS Med Chem Lett 5: 1114-8 (2014)
Article DOI: 10.1021/ml500240d
BindingDB Entry DOI: 10.7270/Q2MC91MW
G-protein coupled receptor 39
(Homo sapiens (Human))
BDBM50030781
(CHEMBL3342372)
Show SMILES Cc1nc(NCc2ccc(Cl)cc2)cc(n1)-c1ccccn1
Show InChI InChI=1S/C17H15ClN4/c1-12-21-16(15-4-2-3-9-19-15)10-17(22-12)20-11-13-5-7-14(18)8-6-13/h2-10H,11H2,1H3,(H,20,21,22)
Reactome pathway
n/an/an/an/a 81n/an/an/an/a
Novartis Institutes for BioMedical Research
Curated by ChEMBL
Assay Description
Agonist activity at human GPR39 expressed in HEK293 cells by IP1 assay
ACS Med Chem Lett 5: 1114-8 (2014)
Article DOI: 10.1021/ml500240d
BindingDB Entry DOI: 10.7270/Q2MC91MW