BDBM50030911 CHEMBL3356555
SMILES: Cc1noc(C)c1-c1ccc(cc1)-c1nc2cnccn2c1NCC(=O)OC(C)(C)C
InChI Key: InChIKey=NYBAHKCREUBCQF-UHFFFAOYSA-N
Data: 1 IC50
Activity Spreadsheet -- Enzyme Inhibition Constant Data from BindingDB
Found 1 hit for monomerid = 50030911
Trg + Lig
Ki
nM
ΔG°
kcal/mole
IC50
nM
Kd
nM
EC50/IC50
nM
koff
s-1
kon
M-1s-1
pHTemp
°C
Bromodomain-containing protein 4
(Homo sapiens (Human))
BDBM50030911
(CHEMBL3356555)
Show SMILES Cc1noc(C)c1-c1ccc(cc1)-c1nc2cnccn2c1NCC(=O)OC(C)(C)C
Show InChI InChI=1S/C23H25N5O3/c1-14-20(15(2)31-27-14)16-6-8-17(9-7-16)21-22(25-13-19(29)30-23(3,4)5)28-11-10-24-12-18(28)26-21/h6-12,25H,13H2,1-5H3
n/an/a 4.96E+3n/an/an/an/an/an/a
Dana-Farber Institute
Curated by ChEMBL
Assay Description
Inhibition of BRD4 (unknown origin) by biotinylated-JQ1 based AlphaScreen BRD binding assay
J Med Chem 57: 9019-27 (2014)
Article DOI: 10.1021/jm501120z
BindingDB Entry DOI: 10.7270/Q2FN17T7