BDBM50030924 CHEMBL3356543
SMILES: Cc1noc(C)c1-c1ccc(cc1)-c1nc2ccccn2c1N
InChI Key: InChIKey=YWHQRPRGTAYJHK-UHFFFAOYSA-N
Data: 1 IC50
Activity Spreadsheet -- Enzyme Inhibition Constant Data from BindingDB
Found 1 hit for monomerid = 50030924
Trg + Lig
Ki
nM
ΔG°
kcal/mole
IC50
nM
Kd
nM
EC50/IC50
nM
koff
s-1
kon
M-1s-1
pHTemp
°C
Bromodomain-containing protein 4
(Homo sapiens (Human))
BDBM50030924
(CHEMBL3356543)
Show SMILES Cc1noc(C)c1-c1ccc(cc1)-c1nc2ccccn2c1N
Show InChI InChI=1S/C18H16N4O/c1-11-16(12(2)23-21-11)13-6-8-14(9-7-13)17-18(19)22-10-4-3-5-15(22)20-17/h3-10H,19H2,1-2H3
n/an/a 3.89E+3n/an/an/an/an/an/a
Dana-Farber Institute
Curated by ChEMBL
Assay Description
Inhibition of BRD4 (unknown origin) by biotinylated-JQ1 based AlphaScreen BRD binding assay
J Med Chem 57: 9019-27 (2014)
Article DOI: 10.1021/jm501120z
BindingDB Entry DOI: 10.7270/Q2FN17T7