BDBM50030925 CHEMBL3356542
SMILES: COc1ccc(cc1)-c1cc(nc(n1)-c1ccccc1)-c1ccc(cc1)-c1c(C)noc1C
InChI Key: InChIKey=BSEDFDUBGPNTBG-UHFFFAOYSA-N
Data: 1 IC50
Activity Spreadsheet -- Enzyme Inhibition Constant Data from BindingDB
Found 1 hit for monomerid = 50030925
Trg + Lig
Ki
nM
ΔG°
kcal/mole
IC50
nM
Kd
nM
EC50/IC50
nM
koff
s-1
kon
M-1s-1
pHTemp
°C
Bromodomain-containing protein 4
(Homo sapiens (Human))
BDBM50030925
(CHEMBL3356542)
Show SMILES COc1ccc(cc1)-c1cc(nc(n1)-c1ccccc1)-c1ccc(cc1)-c1c(C)noc1C
Show InChI InChI=1S/C28H23N3O2/c1-18-27(19(2)33-31-18)22-11-9-20(10-12-22)25-17-26(21-13-15-24(32-3)16-14-21)30-28(29-25)23-7-5-4-6-8-23/h4-17H,1-3H3
n/an/a 6.99E+4n/an/an/an/an/an/a
Dana-Farber Institute
Curated by ChEMBL
Assay Description
Inhibition of BRD4 (unknown origin) by biotinylated-JQ1 based AlphaScreen BRD binding assay
J Med Chem 57: 9019-27 (2014)
Article DOI: 10.1021/jm501120z
BindingDB Entry DOI: 10.7270/Q2FN17T7