BDBM50030928 CHEMBL3356136
SMILES: CCN1C(C2C(C(=O)N(CC)C2=O)[C@]1(C)C(O)=O)c1ccc(cc1)-c1c(C)noc1C
InChI Key: InChIKey=LACNPMHTNKNMLJ-DWLUCLHISA-N
Data: 1 IC50
Activity Spreadsheet -- Enzyme Inhibition Constant Data from BindingDB
Found 1 hit for monomerid = 50030928
Trg + Lig
Ki
nM
ΔG°
kcal/mole
IC50
nM
Kd
nM
EC50/IC50
nM
koff
s-1
kon
M-1s-1
pHTemp
°C
Bromodomain-containing protein 4
(Homo sapiens (Human))
BDBM50030928
(CHEMBL3356136)
Show SMILES CCN1C(C2C(C(=O)N(CC)C2=O)[C@]1(C)C(O)=O)c1ccc(cc1)-c1c(C)noc1C |r|
Show InChI InChI=1S/C23H27N3O5/c1-6-25-20(27)17-18(21(25)28)23(5,22(29)30)26(7-2)19(17)15-10-8-14(9-11-15)16-12(3)24-31-13(16)4/h8-11,17-19H,6-7H2,1-5H3,(H,29,30)/t17?,18?,19?,23-/m1/s1
n/an/a>1.00E+5n/an/an/an/an/an/a
Dana-Farber Institute
Curated by ChEMBL
Assay Description
Inhibition of BRD4 (unknown origin) by biotinylated-JQ1 based AlphaScreen BRD binding assay
J Med Chem 57: 9019-27 (2014)
Article DOI: 10.1021/jm501120z
BindingDB Entry DOI: 10.7270/Q2FN17T7