BDBM50030929 CHEMBL3356135
SMILES: Cc1noc(C)c1-c1ccc(cc1)-c1nc2ccccn2c1NCc1ccccc1
InChI Key: InChIKey=QRCLJTDHTSGENG-UHFFFAOYSA-N
Data: 1 IC50
Activity Spreadsheet -- Enzyme Inhibition Constant Data from BindingDB
Found 1 hit for monomerid = 50030929
Trg + Lig
Ki
nM
ΔG°
kcal/mole
IC50
nM
Kd
nM
EC50/IC50
nM
koff
s-1
kon
M-1s-1
pHTemp
°C
Bromodomain-containing protein 4
(Homo sapiens (Human))
BDBM50030929
(CHEMBL3356135)
Show SMILES Cc1noc(C)c1-c1ccc(cc1)-c1nc2ccccn2c1NCc1ccccc1
Show InChI InChI=1S/C25H22N4O/c1-17-23(18(2)30-28-17)20-11-13-21(14-12-20)24-25(26-16-19-8-4-3-5-9-19)29-15-7-6-10-22(29)27-24/h3-15,26H,16H2,1-2H3
n/an/a 1.10E+4n/an/an/an/an/an/a
Dana-Farber Institute
Curated by ChEMBL
Assay Description
Inhibition of BRD4 (unknown origin) by biotinylated-JQ1 based AlphaScreen BRD binding assay
J Med Chem 57: 9019-27 (2014)
Article DOI: 10.1021/jm501120z
BindingDB Entry DOI: 10.7270/Q2FN17T7