BDBM50031617 CHEMBL3359760
SMILES: CC(C)(C)C#Cc1cnc2Oc3ccc(cc3[C@@]3(COC(N)=N3)c2c1)-c1cccnc1F
InChI Key: InChIKey=HVHWAHSJCSERGA-VWLOTQADSA-N
Data: 1 KI  2 IC50
Activity Spreadsheet -- Enzyme Inhibition Constant Data from BindingDB
Found 3 hits for monomerid = 50031617
Trg + Lig
Ki
nM
ΔG°
kcal/mole
IC50
nM
Kd
nM
EC50/IC50
nM
koff
s-1
kon
M-1s-1
pHTemp
°C
Potassium voltage-gated channel subfamily H member 2
(Homo sapiens (Human))
BDBM50031617
(CHEMBL3359760)
Show SMILES CC(C)(C)C#Cc1cnc2Oc3ccc(cc3[C@@]3(COC(N)=N3)c2c1)-c1cccnc1F |r,c:22|
Show InChI InChI=1S/C25H21FN4O2/c1-24(2,3)9-8-15-11-19-22(29-13-15)32-20-7-6-16(17-5-4-10-28-21(17)26)12-18(20)25(19)14-31-23(27)30-25/h4-7,10-13H,14H2,1-3H3,(H2,27,30)/t25-/m0/s1
Reactome pathway
1.16E+3n/an/an/an/an/an/an/an/a
Amgen, Inc.
Curated by ChEMBL
Assay Description
Inhibition of human ERG channel expressed in HEK293 cells assessed as [3H]-dofetilide binding after 90 mins by liquid scintillation counting analysis
J Med Chem 57: 9811-31 (2014)
Article DOI: 10.1021/jm5012676
BindingDB Entry DOI: 10.7270/Q20G3MRW
Beta-secretase 1
(Homo sapiens (Human))
BDBM50031617
(CHEMBL3359760)
Show SMILES CC(C)(C)C#Cc1cnc2Oc3ccc(cc3[C@@]3(COC(N)=N3)c2c1)-c1cccnc1F |r,c:22|
Show InChI InChI=1S/C25H21FN4O2/c1-24(2,3)9-8-15-11-19-22(29-13-15)32-20-7-6-16(17-5-4-10-28-21(17)26)12-18(20)25(19)14-31-23(27)30-25/h4-7,10-13H,14H2,1-3H3,(H2,27,30)/t25-/m0/s1
n/an/a 4.70n/an/an/an/an/an/a
Amgen, Inc.
Curated by ChEMBL
Assay Description
Inhibition of BACE1 (unknown origin) incubated for 60 mins prior to substrate addition measured after 60 mins by fluorescence assay
J Med Chem 57: 9811-31 (2014)
Article DOI: 10.1021/jm5012676
BindingDB Entry DOI: 10.7270/Q20G3MRW
Beta-secretase 1
(Homo sapiens (Human))
BDBM50031617
(CHEMBL3359760)
Show SMILES CC(C)(C)C#Cc1cnc2Oc3ccc(cc3[C@@]3(COC(N)=N3)c2c1)-c1cccnc1F |r,c:22|
Show InChI InChI=1S/C25H21FN4O2/c1-24(2,3)9-8-15-11-19-22(29-13-15)32-20-7-6-16(17-5-4-10-28-21(17)26)12-18(20)25(19)14-31-23(27)30-25/h4-7,10-13H,14H2,1-3H3,(H2,27,30)/t25-/m0/s1
n/an/a 4.5n/an/an/an/an/an/a
Amgen, Inc.
Curated by ChEMBL
Assay Description
Inhibition of BACE1 in HEK293 cells assessed as Abeta40 level after overnight incubation by sandwich ELISA
J Med Chem 57: 9811-31 (2014)
Article DOI: 10.1021/jm5012676
BindingDB Entry DOI: 10.7270/Q20G3MRW