BDBM50031668 CHEMBL3359782
SMILES: CC(C)[C@H](NC(=O)[C@H](C)NC(=O)[C@@H](N1Cc2ccccc2C1=O)C(C)(C)C)C(=O)C(=O)NCc1ccccc1
InChI Key: InChIKey=NSERSTSKXVNSRV-BFMBIBTESA-N
Data: 2 IC50
Activity Spreadsheet -- Enzyme Inhibition Constant Data from BindingDB
Found 2 hits for monomerid = 50031668
Trg + Lig
Ki
nM
ΔG°
kcal/mole
IC50
nM
Kd
nM
EC50/IC50
nM
koff
s-1
kon
M-1s-1
pHTemp
°C
Peptidase 1 (Der p 1)
(Dermatophagoides pteronyssinus (European house dus...)
BDBM50031668
(CHEMBL3359782)
Show SMILES CC(C)[C@H](NC(=O)[C@H](C)NC(=O)[C@@H](N1Cc2ccccc2C1=O)C(C)(C)C)C(=O)C(=O)NCc1ccccc1 |r|
Show InChI InChI=1S/C30H38N4O5/c1-18(2)23(24(35)27(37)31-16-20-12-8-7-9-13-20)33-26(36)19(3)32-28(38)25(30(4,5)6)34-17-21-14-10-11-15-22(21)29(34)39/h7-15,18-19,23,25H,16-17H2,1-6H3,(H,31,37)(H,32,38)(H,33,36)/t19-,23-,25+/m0/s1
n/an/a 7n/an/an/an/an/an/a
Domainex Ltd.
Curated by ChEMBL
Assay Description
Inhibition of house dust mite Derp-1 after 20 mins
J Med Chem 57: 9447-62 (2014)
Article DOI: 10.1021/jm501102h
BindingDB Entry DOI: 10.7270/Q2R212ZW
Cathepsin B
(Homo sapiens (Human))
BDBM50031668
(CHEMBL3359782)
Show SMILES CC(C)[C@H](NC(=O)[C@H](C)NC(=O)[C@@H](N1Cc2ccccc2C1=O)C(C)(C)C)C(=O)C(=O)NCc1ccccc1 |r|
Show InChI InChI=1S/C30H38N4O5/c1-18(2)23(24(35)27(37)31-16-20-12-8-7-9-13-20)33-26(36)19(3)32-28(38)25(30(4,5)6)34-17-21-14-10-11-15-22(21)29(34)39/h7-15,18-19,23,25H,16-17H2,1-6H3,(H,31,37)(H,32,38)(H,33,36)/t19-,23-,25+/m0/s1
Reactome pathway
n/an/a 429n/an/an/an/an/an/a
Domainex Ltd.
Curated by ChEMBL
Assay Description
Inhibition of human liver cathepsin B using ABz-Gly-Ile-Val-Arg-Ala-Lys-DNP-OH as substrate after 10 mins by fluorescence assay
J Med Chem 57: 9447-62 (2014)
Article DOI: 10.1021/jm501102h
BindingDB Entry DOI: 10.7270/Q2R212ZW