BDBM50031718 CHEMBL3359774
SMILES: C[C@H](NC(=O)[C@H](Cc1ccccc1)NC(=O)c1ccccc1)C(=O)N[C@H](C(=O)C(=O)NC1CCCCC1)C(C)(C)C
InChI Key: InChIKey=AFXVYQANGKXVBZ-IDNYDCHQSA-N
Data: 1 IC50
Activity Spreadsheet -- Enzyme Inhibition Constant Data from BindingDB
Found 1 hit for monomerid = 50031718
Trg + Lig
Ki
nM
ΔG°
kcal/mole
IC50
nM
Kd
nM
EC50/IC50
nM
koff
s-1
kon
M-1s-1
pHTemp
°C
Peptidase 1 (Der p 1)
(Dermatophagoides pteronyssinus (European house dus...)
BDBM50031718
(CHEMBL3359774)
Show SMILES C[C@H](NC(=O)[C@H](Cc1ccccc1)NC(=O)c1ccccc1)C(=O)N[C@H](C(=O)C(=O)NC1CCCCC1)C(C)(C)C |r|
Show InChI InChI=1S/C32H42N4O5/c1-21(28(38)36-27(32(2,3)4)26(37)31(41)34-24-18-12-7-13-19-24)33-30(40)25(20-22-14-8-5-9-15-22)35-29(39)23-16-10-6-11-17-23/h5-6,8-11,14-17,21,24-25,27H,7,12-13,18-20H2,1-4H3,(H,33,40)(H,34,41)(H,35,39)(H,36,38)/t21-,25-,27+/m0/s1
n/an/a 9.17E+3n/an/an/an/an/an/a
Domainex Ltd.
Curated by ChEMBL
Assay Description
Inhibition of house dust mite Derp-1 after 20 mins
J Med Chem 57: 9447-62 (2014)
Article DOI: 10.1021/jm501102h
BindingDB Entry DOI: 10.7270/Q2R212ZW