BDBM50031744 CHEMBL3360350
SMILES: OCc1cc(Cc2ccc(cc2)-c2cccc3nc(NC(=O)C4CC4)nn23)ccc1O
InChI Key: InChIKey=OJDRVJFLSIDYTH-UHFFFAOYSA-N
Data: 1 IC50
Activity Spreadsheet -- Enzyme Inhibition Constant Data from BindingDB
Found 1 hit for monomerid = 50031744
Trg + Lig
Ki
nM
ΔG°
kcal/mole
IC50
nM
Kd
nM
EC50/IC50
nM
koff
s-1
kon
M-1s-1
pHTemp
°C
Tyrosine-protein kinase JAK1
(Homo sapiens (Human))
BDBM50031744
(CHEMBL3360350)
Show SMILES OCc1cc(Cc2ccc(cc2)-c2cccc3nc(NC(=O)C4CC4)nn23)ccc1O
Show InChI InChI=1S/C24H22N4O3/c29-14-19-13-16(6-11-21(19)30)12-15-4-7-17(8-5-15)20-2-1-3-22-25-24(27-28(20)22)26-23(31)18-9-10-18/h1-8,11,13,18,29-30H,9-10,12,14H2,(H,26,27,31)
Reactome pathway
n/an/a 8.30n/an/an/an/an/an/a
Galapagos NV
Curated by ChEMBL
Assay Description
Inhibition of human recombinant JAK1
J Med Chem 57: 9323-42 (2014)
Article DOI: 10.1021/jm501262q
BindingDB Entry DOI: 10.7270/Q2GH9KK6