BDBM50031757 CHEMBL3360327
SMILES: COc1ccc(cc1)-c1cccc2nc(NCC3CC3)nn12
InChI Key: InChIKey=PZCLJXGGAKCDRC-UHFFFAOYSA-N
Data: 1 IC50
Activity Spreadsheet -- Enzyme Inhibition Constant Data from BindingDB
Found 1 hit for monomerid = 50031757
Trg + Lig
Ki
nM
ΔG°
kcal/mole
IC50
nM
Kd
nM
EC50/IC50
nM
koff
s-1
kon
M-1s-1
pHTemp
°C
Tyrosine-protein kinase JAK1
(Homo sapiens (Human))
BDBM50031757
(CHEMBL3360327)
Show SMILES COc1ccc(cc1)-c1cccc2nc(NCC3CC3)nn12
Show InChI InChI=1S/C17H18N4O/c1-22-14-9-7-13(8-10-14)15-3-2-4-16-19-17(20-21(15)16)18-11-12-5-6-12/h2-4,7-10,12H,5-6,11H2,1H3,(H,18,20)
Reactome pathway
n/an/a>1.00E+4n/an/an/an/an/an/a
Galapagos NV
Curated by ChEMBL
Assay Description
Inhibition of human recombinant JAK1
J Med Chem 57: 9323-42 (2014)
Article DOI: 10.1021/jm501262q
BindingDB Entry DOI: 10.7270/Q2GH9KK6