BDBM50031763 CHEMBL3360333
SMILES: COc1ccccc1-c1cccc2nc(NC(=O)C3CC3)nn12
InChI Key: InChIKey=FFPLNPGVZNILRM-UHFFFAOYSA-N
Data: 1 IC50
Activity Spreadsheet -- Enzyme Inhibition Constant Data from BindingDB
Found 1 hit for monomerid = 50031763
Trg + Lig
Ki
nM
ΔG°
kcal/mole
IC50
nM
Kd
nM
EC50/IC50
nM
koff
s-1
kon
M-1s-1
pHTemp
°C
Tyrosine-protein kinase JAK1
(Homo sapiens (Human))
BDBM50031763
(CHEMBL3360333)
Show SMILES COc1ccccc1-c1cccc2nc(NC(=O)C3CC3)nn12
Show InChI InChI=1S/C17H16N4O2/c1-23-14-7-3-2-5-12(14)13-6-4-8-15-18-17(20-21(13)15)19-16(22)11-9-10-11/h2-8,11H,9-10H2,1H3,(H,19,20,22)
Reactome pathway
n/an/a 371n/an/an/an/an/an/a
Galapagos NV
Curated by ChEMBL
Assay Description
Inhibition of human recombinant JAK1
J Med Chem 57: 9323-42 (2014)
Article DOI: 10.1021/jm501262q
BindingDB Entry DOI: 10.7270/Q2GH9KK6