BDBM50031764 CHEMBL3360334
SMILES: O=C(Nc1nc2cccc(-c3cccc4ncccc34)n2n1)C1CC1
InChI Key: InChIKey=XGHWOOPDOGOVER-UHFFFAOYSA-N
Data: 1 IC50
Activity Spreadsheet -- Enzyme Inhibition Constant Data from BindingDB
Found 1 hit for monomerid = 50031764
Trg + Lig
Ki
nM
ΔG°
kcal/mole
IC50
nM
Kd
nM
EC50/IC50
nM
koff
s-1
kon
M-1s-1
pHTemp
°C
Tyrosine-protein kinase JAK1
(Homo sapiens (Human))
BDBM50031764
(CHEMBL3360334)
Show SMILES O=C(Nc1nc2cccc(-c3cccc4ncccc34)n2n1)C1CC1
Show InChI InChI=1S/C19H15N5O/c25-18(12-9-10-12)22-19-21-17-8-2-7-16(24(17)23-19)14-4-1-6-15-13(14)5-3-11-20-15/h1-8,11-12H,9-10H2,(H,22,23,25)
Reactome pathway
n/an/a 2.55E+3n/an/an/an/an/an/a
Galapagos NV
Curated by ChEMBL
Assay Description
Inhibition of human recombinant JAK1
J Med Chem 57: 9323-42 (2014)
Article DOI: 10.1021/jm501262q
BindingDB Entry DOI: 10.7270/Q2GH9KK6