BDBM50032587 CHEMBL3354166
SMILES: CCn1c(NC2CCCC2)nc2c(C)csc2c1=O
InChI Key: InChIKey=LMOGUWWUZTYNSW-UHFFFAOYSA-N
Data: 2 IC50
Activity Spreadsheet -- Enzyme Inhibition Constant Data from BindingDB
Found 2 hits for monomerid = 50032587
Trg + Lig
Ki
nM
ΔG°
kcal/mole
IC50
nM
Kd
nM
EC50/IC50
nM
koff
s-1
kon
M-1s-1
pHTemp
°C
cAMP-specific 3',5'-cyclic phosphodiesterase 4B
(Homo sapiens (Human))
BDBM50032587
(CHEMBL3354166)
Show SMILES CCn1c(NC2CCCC2)nc2c(C)csc2c1=O
Show InChI InChI=1S/C14H19N3OS/c1-3-17-13(18)12-11(9(2)8-19-12)16-14(17)15-10-6-4-5-7-10/h8,10H,3-7H2,1-2H3,(H,15,16)
n/an/a 3.80E+3n/an/an/an/an/an/a
Kyoto 607-8042
Curated by ChEMBL
Assay Description
Inhibition of human PDE4B1 expressed in insect cells assessed as inhibition of [3H]cAMP to [3H]AMP hydrolysis after 30 mins by scintillation counting
J Med Chem 57: 9844-54 (2014)
Article DOI: 10.1021/jm5008215
BindingDB Entry DOI: 10.7270/Q228096D
Phosphodiesterase 7
(Homo sapiens (Human))
BDBM50032587
(CHEMBL3354166)
Show SMILES CCn1c(NC2CCCC2)nc2c(C)csc2c1=O
Show InChI InChI=1S/C14H19N3OS/c1-3-17-13(18)12-11(9(2)8-19-12)16-14(17)15-10-6-4-5-7-10/h8,10H,3-7H2,1-2H3,(H,15,16)
Reactome pathway
n/an/a 98n/an/an/an/an/an/a
Kyoto 607-8042
Curated by ChEMBL
Assay Description
Inhibition of human PDE7A1 expressed in insect cells assessed as inhibition of [3H]cAMP to [3H]AMP hydrolysis after 30 mins by scintillation counting
J Med Chem 57: 9844-54 (2014)
Article DOI: 10.1021/jm5008215
BindingDB Entry DOI: 10.7270/Q228096D