BDBM50032729 CHEMBL3354705
SMILES: CC(C)(C)COc1ccc2Oc3ccc(cc3[C@@]3(COC(N)=N3)c2c1)-c1ccc(F)nc1
InChI Key: InChIKey=KZTWANLURUNJBS-VWLOTQADSA-N
Data: 1 KI  2 IC50
Activity Spreadsheet -- Enzyme Inhibition Constant Data from BindingDB
Found 3 hits for monomerid = 50032729
Trg + Lig
Ki
nM
ΔG°
kcal/mole
IC50
nM
Kd
nM
EC50/IC50
nM
koff
s-1
kon
M-1s-1
pHTemp
°C
Potassium voltage-gated channel subfamily H member 2
(Homo sapiens (Human))
BDBM50032729
(CHEMBL3354705)
Show SMILES CC(C)(C)COc1ccc2Oc3ccc(cc3[C@@]3(COC(N)=N3)c2c1)-c1ccc(F)nc1 |r,c:22|
Show InChI InChI=1S/C25H24FN3O3/c1-24(2,3)13-30-17-6-8-21-19(11-17)25(14-31-23(27)29-25)18-10-15(4-7-20(18)32-21)16-5-9-22(26)28-12-16/h4-12H,13-14H2,1-3H3,(H2,27,29)/t25-/m0/s1
Reactome pathway
259n/an/an/an/an/an/an/an/a
Amgen Inc.
Curated by ChEMBL
Assay Description
Inhibition of human ERG expressing HEK293 cells by [3H]dofetilide binding assay
J Med Chem 57: 9796-810 (2014)
Article DOI: 10.1021/jm501266w
BindingDB Entry DOI: 10.7270/Q28S4RHC
Beta-secretase 1
(Homo sapiens (Human))
BDBM50032729
(CHEMBL3354705)
Show SMILES CC(C)(C)COc1ccc2Oc3ccc(cc3[C@@]3(COC(N)=N3)c2c1)-c1ccc(F)nc1 |r,c:22|
Show InChI InChI=1S/C25H24FN3O3/c1-24(2,3)13-30-17-6-8-21-19(11-17)25(14-31-23(27)29-25)18-10-15(4-7-20(18)32-21)16-5-9-22(26)28-12-16/h4-12H,13-14H2,1-3H3,(H2,27,29)/t25-/m0/s1
n/an/a 113n/an/an/an/an/an/a
Amgen Inc.
Curated by ChEMBL
Assay Description
Inhibition of BACE1 in HEK293T cells expressing APPswedish mutant assessed as inhibition of amyloid beta 40 production by sandwich ELISA
J Med Chem 57: 9796-810 (2014)
Article DOI: 10.1021/jm501266w
BindingDB Entry DOI: 10.7270/Q28S4RHC
Beta-secretase 1
(Homo sapiens (Human))
BDBM50032729
(CHEMBL3354705)
Show SMILES CC(C)(C)COc1ccc2Oc3ccc(cc3[C@@]3(COC(N)=N3)c2c1)-c1ccc(F)nc1 |r,c:22|
Show InChI InChI=1S/C25H24FN3O3/c1-24(2,3)13-30-17-6-8-21-19(11-17)25(14-31-23(27)29-25)18-10-15(4-7-20(18)32-21)16-5-9-22(26)28-12-16/h4-12H,13-14H2,1-3H3,(H2,27,29)/t25-/m0/s1
n/an/a 6n/an/an/an/an/an/a
Amgen Inc.
Curated by ChEMBL
Assay Description
Inhibition of BACE1 (unknown origin) assessed as enhancement of fluorescence intensity
J Med Chem 57: 9796-810 (2014)
Article DOI: 10.1021/jm501266w
BindingDB Entry DOI: 10.7270/Q28S4RHC