BDBM50032920 CHEMBL3356138
SMILES: COc1ccccc1C(=O)Nc1cc2[nH]c(=O)n(C)c2cc1N1CCCCC1
InChI Key: InChIKey=QYDUQYKVEIRSMB-UHFFFAOYSA-N
Data: 2 IC50
Activity Spreadsheet -- Enzyme Inhibition Constant Data from BindingDB
Found 2 hits for monomerid = 50032920
Trg + Lig
Ki
nM
ΔG°
kcal/mole
IC50
nM
Kd
nM
EC50/IC50
nM
koff
s-1
kon
M-1s-1
pHTemp
°C
Peregrin
(Homo sapiens (Human))
BDBM50032920
(CHEMBL3356138)
Show SMILES COc1ccccc1C(=O)Nc1cc2[nH]c(=O)n(C)c2cc1N1CCCCC1
Show InChI InChI=1S/C21H24N4O3/c1-24-17-13-18(25-10-6-3-7-11-25)16(12-15(17)23-21(24)27)22-20(26)14-8-4-5-9-19(14)28-2/h4-5,8-9,12-13H,3,6-7,10-11H2,1-2H3,(H,22,26)(H,23,27)
n/an/a 631n/an/an/an/an/an/a
GlaxoSmithKline
Curated by ChEMBL
Assay Description
Binding affinity to 6H-Flag-tagged Tev-BRPF1 (622-738 aa) (unknown origin) by TR-FRET competitive assay
ACS Med Chem Lett 5: 1190-5 (2014)
Article DOI: 10.1021/ml5002932
BindingDB Entry DOI: 10.7270/Q2445P29
Bromodomain-containing protein 4
(Homo sapiens (Human))
BDBM50032920
(CHEMBL3356138)
Show SMILES COc1ccccc1C(=O)Nc1cc2[nH]c(=O)n(C)c2cc1N1CCCCC1
Show InChI InChI=1S/C21H24N4O3/c1-24-17-13-18(25-10-6-3-7-11-25)16(12-15(17)23-21(24)27)22-20(26)14-8-4-5-9-19(14)28-2/h4-5,8-9,12-13H,3,6-7,10-11H2,1-2H3,(H,22,26)(H,23,27)
n/an/a<5.01E+4n/an/an/an/an/an/a
GlaxoSmithKline
Curated by ChEMBL
Assay Description
Binding affinity to 6His-tagged-BRD4 BD1 Y390A mutant (1 to 477 aa) (unknown origin) by TR-FRET competitive assay
ACS Med Chem Lett 5: 1190-5 (2014)
Article DOI: 10.1021/ml5002932
BindingDB Entry DOI: 10.7270/Q2445P29