BDBM50032928 CHEMBL3356145
SMILES: COc1ccccc1C(=O)Nc1cc2n(C)c(=O)n(C)c2cc1OC
InChI Key: InChIKey=IAOOGJGNGLFUMT-UHFFFAOYSA-N
Data: 2 IC50
Activity Spreadsheet -- Enzyme Inhibition Constant Data from BindingDB
Found 2 hits for monomerid = 50032928
Trg + Lig
Ki
nM
ΔG°
kcal/mole
IC50
nM
Kd
nM
EC50/IC50
nM
koff
s-1
kon
M-1s-1
pHTemp
°C
Peregrin
(Homo sapiens (Human))
BDBM50032928
(CHEMBL3356145)
Show SMILES COc1ccccc1C(=O)Nc1cc2n(C)c(=O)n(C)c2cc1OC
Show InChI InChI=1S/C18H19N3O4/c1-20-13-9-12(16(25-4)10-14(13)21(2)18(20)23)19-17(22)11-7-5-6-8-15(11)24-3/h5-10H,1-4H3,(H,19,22)
n/an/a 126n/an/an/an/an/an/a
GlaxoSmithKline
Curated by ChEMBL
Assay Description
Inhibition of synthetic fluorescent ligand binding to recombinant truncated 6H-Flag-TEV-BRPF1 (622 to 738 residues) (unknown origin) expressed in Esc...
ACS Med Chem Lett 7: 552-7 (2016)
BindingDB Entry DOI: 10.7270/Q2S184G2
Peregrin
(Homo sapiens (Human))
BDBM50032928
(CHEMBL3356145)
Show SMILES COc1ccccc1C(=O)Nc1cc2n(C)c(=O)n(C)c2cc1OC
Show InChI InChI=1S/C18H19N3O4/c1-20-13-9-12(16(25-4)10-14(13)21(2)18(20)23)19-17(22)11-7-5-6-8-15(11)24-3/h5-10H,1-4H3,(H,19,22)
n/an/a 126n/an/an/an/an/an/a
GlaxoSmithKline
Curated by ChEMBL
Assay Description
Binding affinity to 6H-Flag-tagged Tev-BRPF1 (622-738 aa) (unknown origin) by TR-FRET competitive assay
ACS Med Chem Lett 5: 1190-5 (2014)
Article DOI: 10.1021/ml5002932
BindingDB Entry DOI: 10.7270/Q2445P29