BDBM50033063 4-[(Z)-1-(5,5,8,8-Tetramethyl-5,6,7,8-tetrahydro-naphthalen-2-yl)-propenyl]-benzoic acid::CHEMBL115050
SMILES: C\C=C(\c1ccc(cc1)C(O)=O)c1ccc2c(c1)C(C)(C)CCC2(C)C
InChI Key: InChIKey=ADPKGIMONMWKST-SWNXQHNESA-N
Data: 4 EC50
Activity Spreadsheet -- Enzyme Inhibition Constant Data from BindingDB
Found 4 hits for monomerid = 50033063
Trg + Lig
Ki
nM
ΔG°
kcal/mole
IC50
nM
Kd
nM
EC50/IC50
nM
koff
s-1
kon
M-1s-1
pHTemp
°C
Retinoic acid receptor RXR-alpha
(Homo sapiens (Human))
BDBM50033063
(4-[(Z)-1-(5,5,8,8-Tetramethyl-5,6,7,8-tetrahydro-n...)
Show SMILES C\C=C(\c1ccc(cc1)C(O)=O)c1ccc2c(c1)C(C)(C)CCC2(C)C
Show InChI InChI=1S/C24H28O2/c1-6-19(16-7-9-17(10-8-16)22(25)26)18-11-12-20-21(15-18)24(4,5)14-13-23(20,2)3/h6-12,15H,13-14H2,1-5H3,(H,25,26)/b19-6-
NCI pathway
Reactome pathway
n/an/an/an/a 55n/an/an/an/a
SRI International
Curated by ChEMBL
Assay Description
Effective concentration against Retinoic acid receptor RXR-alpha
J Med Chem 38: 3368-83 (1995)
BindingDB Entry DOI: 10.7270/Q24748WR
Retinoic acid receptor RXR-alpha
(Homo sapiens (Human))
BDBM50033063
(4-[(Z)-1-(5,5,8,8-Tetramethyl-5,6,7,8-tetrahydro-n...)
Show SMILES C\C=C(\c1ccc(cc1)C(O)=O)c1ccc2c(c1)C(C)(C)CCC2(C)C
Show InChI InChI=1S/C24H28O2/c1-6-19(16-7-9-17(10-8-16)22(25)26)18-11-12-20-21(15-18)24(4,5)14-13-23(20,2)3/h6-12,15H,13-14H2,1-5H3,(H,25,26)/b19-6-
NCI pathway
Reactome pathway
n/an/an/an/a 470n/an/an/an/a
SRI International
Curated by ChEMBL
Assay Description
Effective concentration against Retinoic acid receptor RXR-alpha
J Med Chem 38: 3368-83 (1995)
BindingDB Entry DOI: 10.7270/Q24748WR
Retinoid X receptor gamma/retinoic acid receptor alpha
(Homo sapiens (Human))
BDBM50033063
(4-[(Z)-1-(5,5,8,8-Tetramethyl-5,6,7,8-tetrahydro-n...)
Show SMILES C\C=C(\c1ccc(cc1)C(O)=O)c1ccc2c(c1)C(C)(C)CCC2(C)C
Show InChI InChI=1S/C24H28O2/c1-6-19(16-7-9-17(10-8-16)22(25)26)18-11-12-20-21(15-18)24(4,5)14-13-23(20,2)3/h6-12,15H,13-14H2,1-5H3,(H,25,26)/b19-6-
NCI pathway
Reactome pathway
n/an/an/an/a 370n/an/an/an/a
SRI International
Curated by ChEMBL
Assay Description
Effective concentrations against Retinoic acid receptor RXR-gamma
J Med Chem 38: 3368-83 (1995)
BindingDB Entry DOI: 10.7270/Q24748WR
Retinoid receptor
(Homo sapiens (Human))
BDBM50033063
(4-[(Z)-1-(5,5,8,8-Tetramethyl-5,6,7,8-tetrahydro-n...)
Show SMILES C\C=C(\c1ccc(cc1)C(O)=O)c1ccc2c(c1)C(C)(C)CCC2(C)C
Show InChI InChI=1S/C24H28O2/c1-6-19(16-7-9-17(10-8-16)22(25)26)18-11-12-20-21(15-18)24(4,5)14-13-23(20,2)3/h6-12,15H,13-14H2,1-5H3,(H,25,26)/b19-6-
Reactome pathway
n/an/an/an/a 160n/an/an/an/a
SRI International
Curated by ChEMBL
Assay Description
Effective concentrations against Retinoic acid receptor RXR-beta
J Med Chem 38: 3368-83 (1995)
BindingDB Entry DOI: 10.7270/Q24748WR