null
SMILES: CC1(C)CCC(C)(C)c2cc(ccc12)C1(SCCCS1)c1ccc(cc1)C(O)=O
InChI Key: InChIKey=CXCXPZCHVMTIJF-UHFFFAOYSA-N
Activity Spreadsheet -- Enzyme Inhibition Constant Data from BindingDB
Found 2 hits for monomerid = 50033075
Trg + Lig
Ki
nM
ΔG°
kcal/mole
IC50
nM
Kd
nM
EC50/IC50
nM
koff
s-1
kon
M-1s-1
pHTemp
°C
Retinoic acid receptor RXR-alpha
(Homo sapiens (Human))
BDBM50033075
(4-[2-(5,5,8,8-Tetramethyl-5,6,7,8-tetrahydro-napht...)
Show SMILES CC1(C)CCC(C)(C)c2cc(ccc12)C1(SCCCS1)c1ccc(cc1)C(O)=O
Show InChI InChI=1S/C25H30O2S2/c1-23(2)12-13-24(3,4)21-16-19(10-11-20(21)23)25(28-14-5-15-29-25)18-8-6-17(7-9-18)22(26)27/h6-11,16H,5,12-15H2,1-4H3,(H,26,27)
NCI pathway
Reactome pathway
n/an/an/an/a 540n/an/an/an/a
SRI International
Curated by ChEMBL
Assay Description
Effective concentration against Retinoic acid receptor RXR-alpha
J Med Chem 38: 3368-83 (1995)
BindingDB Entry DOI: 10.7270/Q24748WR
Retinoic acid receptor RXR-alpha
(Homo sapiens (Human))
BDBM50033075
(4-[2-(5,5,8,8-Tetramethyl-5,6,7,8-tetrahydro-napht...)
Show SMILES CC1(C)CCC(C)(C)c2cc(ccc12)C1(SCCCS1)c1ccc(cc1)C(O)=O
Show InChI InChI=1S/C25H30O2S2/c1-23(2)12-13-24(3,4)21-16-19(10-11-20(21)23)25(28-14-5-15-29-25)18-8-6-17(7-9-18)22(26)27/h6-11,16H,5,12-15H2,1-4H3,(H,26,27)
NCI pathway
Reactome pathway
n/an/an/an/a 630n/an/an/an/a
SRI International
Curated by ChEMBL
Assay Description
Effective concentration against Retinoic acid receptor RXR-alpha
J Med Chem 38: 3368-83 (1995)
BindingDB Entry DOI: 10.7270/Q24748WR