BDBM50033118 CHEMBL3357063
SMILES: CN1CCN(CC1)c1ccc(cc1)-c1ncc2CCN(CCN3CCOCC3)c2n1
InChI Key: InChIKey=VDCMKOIMSDFQQV-UHFFFAOYSA-N
Data: 1 IC50
Activity Spreadsheet -- Enzyme Inhibition Constant Data from BindingDB
Found 1 hit for monomerid = 50033118
Trg + Lig
Ki
nM
ΔG°
kcal/mole
IC50
nM
Kd
nM
EC50/IC50
nM
koff
s-1
kon
M-1s-1
pHTemp
°C
Toll-like receptor 9
(Homo sapiens (Human))
BDBM50033118
(CHEMBL3357063)
Show SMILES CN1CCN(CC1)c1ccc(cc1)-c1ncc2CCN(CCN3CCOCC3)c2n1
Show InChI InChI=1S/C23H32N6O/c1-26-8-11-28(12-9-26)21-4-2-19(3-5-21)22-24-18-20-6-7-29(23(20)25-22)13-10-27-14-16-30-17-15-27/h2-5,18H,6-17H2,1H3
n/an/a 73n/an/an/an/an/an/a
Sumitomo Dainippon Pharma Co., Ltd.
Curated by ChEMBL
Assay Description
Antagonist activity at human TLR9 transfected in HEK293 cells after 6 hrs by NF-kappaB luciferase reporter assay
ACS Med Chem Lett 5: 1235-9 (2014)
Article DOI: 10.1021/ml5003184
BindingDB Entry DOI: 10.7270/Q2M32XBN