null
SMILES: CN1CCN(CC1)c1ccc(cc1)-c1nc2N(CCCN3CCCC3)CCc2c(Cl)n1
InChI Key: InChIKey=STJYNRMIXPPOHW-UHFFFAOYSA-N
Activity Spreadsheet -- Enzyme Inhibition Constant Data from BindingDB
Found 1 hit for monomerid = 50033122
Trg + Lig
Ki
nM
ΔG°
kcal/mole
IC50
nM
Kd
nM
EC50/IC50
nM
koff
s-1
kon
M-1s-1
pHTemp
°C
Toll-like receptor 9
(Homo sapiens (Human))
BDBM50033122
(CHEMBL3356619)
Show SMILES CN1CCN(CC1)c1ccc(cc1)-c1nc2N(CCCN3CCCC3)CCc2c(Cl)n1
Show InChI InChI=1S/C24H33ClN6/c1-28-15-17-30(18-16-28)20-7-5-19(6-8-20)23-26-22(25)21-9-14-31(24(21)27-23)13-4-12-29-10-2-3-11-29/h5-8H,2-4,9-18H2,1H3
n/an/a 84n/an/an/an/an/an/a
Sumitomo Dainippon Pharma Co., Ltd.
Curated by ChEMBL
Assay Description
Antagonist activity at human TLR9 transfected in HEK293 cells after 6 hrs by NF-kappaB luciferase reporter assay
ACS Med Chem Lett 5: 1235-9 (2014)
Article DOI: 10.1021/ml5003184
BindingDB Entry DOI: 10.7270/Q2M32XBN