BDBM50033386 CHEMBL3357654
SMILES: COc1cc2ncnc(Nc3cccc(Br)c3)c2cc1NC(=O)C(\F)=C\CN(C)C
InChI Key: InChIKey=DKOJJTJTHLDNCA-APSNUPSMSA-N
Data: 2 IC50
Activity Spreadsheet -- Enzyme Inhibition Constant Data from BindingDB
Found 2 hits for monomerid = 50033386
Trg + Lig
Ki
nM
ΔG°
kcal/mole
IC50
nM
Kd
nM
EC50/IC50
nM
koff
s-1
kon
M-1s-1
pHTemp
°C
Epidermal growth factor receptor
(Homo sapiens (Human))
BDBM50033386
(CHEMBL3357654)
Show SMILES COc1cc2ncnc(Nc3cccc(Br)c3)c2cc1NC(=O)C(\F)=C\CN(C)C
Show InChI InChI=1S/C21H21BrFN5O2/c1-28(2)8-7-16(23)21(29)27-18-10-15-17(11-19(18)30-3)24-12-25-20(15)26-14-6-4-5-13(22)9-14/h4-7,9-12H,8H2,1-3H3,(H,27,29)(H,24,25,26)/b16-7-
n/an/a 8.30n/an/an/an/an/an/a
Zhejiang University
Curated by ChEMBL
Assay Description
Inhibition of wild type EGFR T790M mutant (unknown origin) incubated for 5 mins by HTRF assay
J Med Chem 57: 9889-900 (2014)
Article DOI: 10.1021/jm5014659
BindingDB Entry DOI: 10.7270/Q26W9CPC
Epidermal growth factor receptor
(Homo sapiens (Human))
BDBM50033386
(CHEMBL3357654)
Show SMILES COc1cc2ncnc(Nc3cccc(Br)c3)c2cc1NC(=O)C(\F)=C\CN(C)C
Show InChI InChI=1S/C21H21BrFN5O2/c1-28(2)8-7-16(23)21(29)27-18-10-15-17(11-19(18)30-3)24-12-25-20(15)26-14-6-4-5-13(22)9-14/h4-7,9-12H,8H2,1-3H3,(H,27,29)(H,24,25,26)/b16-7-
n/an/a 2.60n/an/an/an/an/an/a
Zhejiang University
Curated by ChEMBL
Assay Description
Inhibition of wild type EGFR (unknown origin) incubated for 5 mins by HTRF assay
J Med Chem 57: 9889-900 (2014)
Article DOI: 10.1021/jm5014659
BindingDB Entry DOI: 10.7270/Q26W9CPC