BDBM50033395 CHEMBL3357638
SMILES: CCOc1cc2ncnc(Nc3ccc(OCc4ccccn4)c(Cl)c3)c2cc1NC(=O)C(\F)=C/CN(C)C
InChI Key: InChIKey=LHHLPNVJMCVRGH-LSHDLFTRSA-N
Data: 1 IC50
Activity Spreadsheet -- Enzyme Inhibition Constant Data from BindingDB
Found 1 hit for monomerid = 50033395
Trg + Lig
Ki
nM
ΔG°
kcal/mole
IC50
nM
Kd
nM
EC50/IC50
nM
koff
s-1
kon
M-1s-1
pHTemp
°C
Epidermal growth factor receptor
(Homo sapiens (Human))
BDBM50033395
(CHEMBL3357638)
Show SMILES CCOc1cc2ncnc(Nc3ccc(OCc4ccccn4)c(Cl)c3)c2cc1NC(=O)C(\F)=C/CN(C)C
Show InChI InChI=1S/C28H28ClFN6O3/c1-4-38-26-15-23-20(14-24(26)35-28(37)22(30)10-12-36(2)3)27(33-17-32-23)34-18-8-9-25(21(29)13-18)39-16-19-7-5-6-11-31-19/h5-11,13-15,17H,4,12,16H2,1-3H3,(H,35,37)(H,32,33,34)/b22-10+
n/an/a 0.890n/an/an/an/an/an/a
Zhejiang University
Curated by ChEMBL
Assay Description
Inhibition of wild type EGFR (unknown origin) incubated for 5 mins by HTRF assay
J Med Chem 57: 9889-900 (2014)
Article DOI: 10.1021/jm5014659
BindingDB Entry DOI: 10.7270/Q26W9CPC