BDBM50033471 (S)-2-[(S)-2-((S)-3-Carbamoyl-2-{(S)-3-methyl-2-[(S)-3-methyl-2-((S)-2-methyl-3-phenyl-propionylamino)-butyrylamino]-butyrylamino}-propionylamino)-3-carboxy-propionylamino]-4-methyl-pentanoic acid::CHEMBL120527
SMILES: CC(C)C[C@H](NC(=O)[C@H](CC(O)=O)NC(=O)[C@H](CC(N)=O)NC(=O)[C@@H](NC(=O)[C@@H](NC(=O)[C@@H](C)Cc1ccccc1)C(C)C)C(C)C)C(O)=O
InChI Key: InChIKey=PQOWYSIMYNJTLG-QMIPHYMYSA-N
Data: 1 IC50
Activity Spreadsheet -- Enzyme Inhibition Constant Data from BindingDB
Found 1 hit for monomerid = 50033471
Trg + Lig
Ki
nM
ΔG°
kcal/mole
IC50
nM
Kd
nM
EC50/IC50
nM
koff
s-1
kon
M-1s-1
pHTemp
°C
RRM1/RRM2 holoenzyme
(Homo sapiens (Human))
BDBM50033471
((S)-2-[(S)-2-((S)-3-Carbamoyl-2-{(S)-3-methyl-2-[(...)
Show SMILES CC(C)C[C@H](NC(=O)[C@H](CC(O)=O)NC(=O)[C@H](CC(N)=O)NC(=O)[C@@H](NC(=O)[C@@H](NC(=O)[C@@H](C)Cc1ccccc1)C(C)C)C(C)C)C(O)=O
Show InChI InChI=1S/C34H52N6O10/c1-17(2)13-24(34(49)50)38-31(46)23(16-26(42)43)36-30(45)22(15-25(35)41)37-32(47)27(18(3)4)40-33(48)28(19(5)6)39-29(44)20(7)14-21-11-9-8-10-12-21/h8-12,17-20,22-24,27-28H,13-16H2,1-7H3,(H2,35,41)(H,36,45)(H,37,47)(H,38,46)(H,39,44)(H,40,48)(H,42,43)(H,49,50)/t20-,22-,23-,24-,27-,28-/m0/s1
Reactome pathway
n/an/a 1.10E+4n/an/an/an/an/an/a
Bio-M£ga/Boehringer Ingelheim Research Inc.
Curated by ChEMBL
Assay Description
In vitro inhibitory activity against HSV ribonucleotide reductase
J Med Chem 38: 3617-23 (1995)
BindingDB Entry DOI: 10.7270/Q21V5FMW