BDBM50033636 3-{2-[2-(2-{2-[2-tert-Butoxycarbonylamino-3-(4-sulfo-phenyl)-propionylamino]-hexanoylamino}-acetylamino)-3-(1H-indol-3-yl)-propionylamino]-hexanoylamino}-6-phenoxy-hexanoic acid::CHEMBL385918::CHEMBL414180
SMILES: CCCC[C@H](NC(=O)[C@H](Cc1ccc(cc1)S(O)(=O)=O)NC(=O)OC(C)(C)C)C(=O)NCC(=O)N[C@H](Cc1c[nH]c2ccccc12)C(=O)N[C@@H](CCCC)C(=O)NC(CCCOc1ccccc1)CC(O)=O
InChI Key: InChIKey=CWCIEGCNXSWALH-FSPWFZOQSA-N
Data: 8 IC50
Activity Spreadsheet -- Enzyme Inhibition Constant Data from BindingDB
Found 8 hits for monomerid = 50033636
Trg + Lig
Ki
nM
ΔG°
kcal/mole
IC50
nM
Kd
nM
EC50/IC50
nM
koff
s-1
kon
M-1s-1
pHTemp
°C
Cholecystokinin receptor
(Homo sapiens (Human))
BDBM50033636
(3-{2-[2-(2-{2-[2-tert-Butoxycarbonylamino-3-(4-sul...)
Show SMILES CCCC[C@H](NC(=O)[C@H](Cc1ccc(cc1)S(O)(=O)=O)NC(=O)OC(C)(C)C)C(=O)NCC(=O)N[C@H](Cc1c[nH]c2ccccc12)C(=O)N[C@@H](CCCC)C(=O)NC(CCCOc1ccccc1)CC(O)=O
Show InChI InChI=1S/C51H69N7O13S/c1-6-8-20-40(56-48(64)42(58-50(66)71-51(3,4)5)28-33-23-25-37(26-24-33)72(67,68)69)46(62)53-32-44(59)55-43(29-34-31-52-39-22-14-13-19-38(34)39)49(65)57-41(21-9-7-2)47(63)54-35(30-45(60)61)16-15-27-70-36-17-11-10-12-18-36/h10-14,17-19,22-26,31,35,40-43,52H,6-9,15-16,20-21,27-30,32H2,1-5H3,(H,53,62)(H,54,63)(H,55,59)(H,56,64)(H,57,65)(H,58,66)(H,60,61)(H,67,68,69)/t35?,40-,41-,42-,43+/m0/s1
Reactome pathway
n/an/a 1.75E+3n/an/an/an/an/an/a
EP CNRS 51
Curated by ChEMBL
Assay Description
Inhibition of [125I]-BH-CCK- binding to cholecystokinin type B receptor from guinea pig brain membranes
J Med Chem 36: 3021-8 (1993)
BindingDB Entry DOI: 10.7270/Q2PZ57VG
Pancreatic alpha-amylase (HPA)
(Homo sapiens (Human))
BDBM50033636
(3-{2-[2-(2-{2-[2-tert-Butoxycarbonylamino-3-(4-sul...)
Show SMILES CCCC[C@H](NC(=O)[C@H](Cc1ccc(cc1)S(O)(=O)=O)NC(=O)OC(C)(C)C)C(=O)NCC(=O)N[C@H](Cc1c[nH]c2ccccc12)C(=O)N[C@@H](CCCC)C(=O)NC(CCCOc1ccccc1)CC(O)=O
Show InChI InChI=1S/C51H69N7O13S/c1-6-8-20-40(56-48(64)42(58-50(66)71-51(3,4)5)28-33-23-25-37(26-24-33)72(67,68)69)46(62)53-32-44(59)55-43(29-34-31-52-39-22-14-13-19-38(34)39)49(65)57-41(21-9-7-2)47(63)54-35(30-45(60)61)16-15-27-70-36-17-11-10-12-18-36/h10-14,17-19,22-26,31,35,40-43,52H,6-9,15-16,20-21,27-30,32H2,1-5H3,(H,53,62)(H,54,63)(H,55,59)(H,56,64)(H,57,65)(H,58,66)(H,60,61)(H,67,68,69)/t35?,40-,41-,42-,43+/m0/s1
n/an/a 1n/an/an/an/an/an/a
EP CNRS 51
Curated by ChEMBL
Assay Description
Tested in vitro for inhibition of amylase release from rat pancreatic acini
J Med Chem 36: 3021-8 (1993)
BindingDB Entry DOI: 10.7270/Q2PZ57VG
CCKBR
(RAT)
BDBM50033636
(3-{2-[2-(2-{2-[2-tert-Butoxycarbonylamino-3-(4-sul...)
Show SMILES CCCC[C@H](NC(=O)[C@H](Cc1ccc(cc1)S(O)(=O)=O)NC(=O)OC(C)(C)C)C(=O)NCC(=O)N[C@H](Cc1c[nH]c2ccccc12)C(=O)N[C@@H](CCCC)C(=O)NC(CCCOc1ccccc1)CC(O)=O
Show InChI InChI=1S/C51H69N7O13S/c1-6-8-20-40(56-48(64)42(58-50(66)71-51(3,4)5)28-33-23-25-37(26-24-33)72(67,68)69)46(62)53-32-44(59)55-43(29-34-31-52-39-22-14-13-19-38(34)39)49(65)57-41(21-9-7-2)47(63)54-35(30-45(60)61)16-15-27-70-36-17-11-10-12-18-36/h10-14,17-19,22-26,31,35,40-43,52H,6-9,15-16,20-21,27-30,32H2,1-5H3,(H,53,62)(H,54,63)(H,55,59)(H,56,64)(H,57,65)(H,58,66)(H,60,61)(H,67,68,69)/t35?,40-,41-,42-,43+/m0/s1
n/an/a 42n/an/an/an/an/an/a
EP CNRS 51
Curated by ChEMBL
Assay Description
Inhibition of [125I]-BH-CCK- binding to peripheral cholecystokinin type B receptor from rat pancreatic acini
J Med Chem 36: 3021-8 (1993)
BindingDB Entry DOI: 10.7270/Q2PZ57VG
Cholecystokinin receptor
(RAT)
BDBM50033636
(3-{2-[2-(2-{2-[2-tert-Butoxycarbonylamino-3-(4-sul...)
Show SMILES CCCC[C@H](NC(=O)[C@H](Cc1ccc(cc1)S(O)(=O)=O)NC(=O)OC(C)(C)C)C(=O)NCC(=O)N[C@H](Cc1c[nH]c2ccccc12)C(=O)N[C@@H](CCCC)C(=O)NC(CCCOc1ccccc1)CC(O)=O
Show InChI InChI=1S/C51H69N7O13S/c1-6-8-20-40(56-48(64)42(58-50(66)71-51(3,4)5)28-33-23-25-37(26-24-33)72(67,68)69)46(62)53-32-44(59)55-43(29-34-31-52-39-22-14-13-19-38(34)39)49(65)57-41(21-9-7-2)47(63)54-35(30-45(60)61)16-15-27-70-36-17-11-10-12-18-36/h10-14,17-19,22-26,31,35,40-43,52H,6-9,15-16,20-21,27-30,32H2,1-5H3,(H,53,62)(H,54,63)(H,55,59)(H,56,64)(H,57,65)(H,58,66)(H,60,61)(H,67,68,69)/t35?,40-,41-,42-,43+/m0/s1
n/an/a 18n/an/an/an/an/an/a
EP CNRS 51
Curated by ChEMBL
Assay Description
Inhibition of [125I]-BH-CCK- binding to cholecystokinin type B receptor from guinea pig brain membranes
J Med Chem 36: 3021-8 (1993)
BindingDB Entry DOI: 10.7270/Q2PZ57VG
Pancreatic alpha-amylase
(Homo sapiens (Human))
BDBM50033636
(3-{2-[2-(2-{2-[2-tert-Butoxycarbonylamino-3-(4-sul...)
Show SMILES CCCC[C@H](NC(=O)[C@H](Cc1ccc(cc1)S(O)(=O)=O)NC(=O)OC(C)(C)C)C(=O)NCC(=O)N[C@H](Cc1c[nH]c2ccccc12)C(=O)N[C@@H](CCCC)C(=O)NC(CCCOc1ccccc1)CC(O)=O
Show InChI InChI=1S/C51H69N7O13S/c1-6-8-20-40(56-48(64)42(58-50(66)71-51(3,4)5)28-33-23-25-37(26-24-33)72(67,68)69)46(62)53-32-44(59)55-43(29-34-31-52-39-22-14-13-19-38(34)39)49(65)57-41(21-9-7-2)47(63)54-35(30-45(60)61)16-15-27-70-36-17-11-10-12-18-36/h10-14,17-19,22-26,31,35,40-43,52H,6-9,15-16,20-21,27-30,32H2,1-5H3,(H,53,62)(H,54,63)(H,55,59)(H,56,64)(H,57,65)(H,58,66)(H,60,61)(H,67,68,69)/t35?,40-,41-,42-,43+/m0/s1
n/an/a 8n/an/an/an/an/an/a
EP CNRS 51
Curated by ChEMBL
Assay Description
Inhibition of [125I]-BH-CCK- binding to cholecystokinin type B receptor from jurkat Tcells
J Med Chem 36: 3021-8 (1993)
BindingDB Entry DOI: 10.7270/Q2PZ57VG
Cholecystokinin receptor
(Homo sapiens (Human))
BDBM50033636
(3-{2-[2-(2-{2-[2-tert-Butoxycarbonylamino-3-(4-sul...)
Show SMILES CCCC[C@H](NC(=O)[C@H](Cc1ccc(cc1)S(O)(=O)=O)NC(=O)OC(C)(C)C)C(=O)NCC(=O)N[C@H](Cc1c[nH]c2ccccc12)C(=O)N[C@@H](CCCC)C(=O)NC(CCCOc1ccccc1)CC(O)=O
Show InChI InChI=1S/C51H69N7O13S/c1-6-8-20-40(56-48(64)42(58-50(66)71-51(3,4)5)28-33-23-25-37(26-24-33)72(67,68)69)46(62)53-32-44(59)55-43(29-34-31-52-39-22-14-13-19-38(34)39)49(65)57-41(21-9-7-2)47(63)54-35(30-45(60)61)16-15-27-70-36-17-11-10-12-18-36/h10-14,17-19,22-26,31,35,40-43,52H,6-9,15-16,20-21,27-30,32H2,1-5H3,(H,53,62)(H,54,63)(H,55,59)(H,56,64)(H,57,65)(H,58,66)(H,60,61)(H,67,68,69)/t35?,40-,41-,42-,43+/m0/s1
Reactome pathway
n/an/a 1.40E+3n/an/an/an/an/an/a
EP CNRS 51
Curated by ChEMBL
Assay Description
Inhibition of [125I]-BH-CCK- binding to cholecystokinin type B receptor from guinea pig brain membranes
J Med Chem 36: 3021-8 (1993)
BindingDB Entry DOI: 10.7270/Q2PZ57VG
Cholecystokinin receptor
(Homo sapiens (Human))
BDBM50033636
(3-{2-[2-(2-{2-[2-tert-Butoxycarbonylamino-3-(4-sul...)
Show SMILES CCCC[C@H](NC(=O)[C@H](Cc1ccc(cc1)S(O)(=O)=O)NC(=O)OC(C)(C)C)C(=O)NCC(=O)N[C@H](Cc1c[nH]c2ccccc12)C(=O)N[C@@H](CCCC)C(=O)NC(CCCOc1ccccc1)CC(O)=O
Show InChI InChI=1S/C51H69N7O13S/c1-6-8-20-40(56-48(64)42(58-50(66)71-51(3,4)5)28-33-23-25-37(26-24-33)72(67,68)69)46(62)53-32-44(59)55-43(29-34-31-52-39-22-14-13-19-38(34)39)49(65)57-41(21-9-7-2)47(63)54-35(30-45(60)61)16-15-27-70-36-17-11-10-12-18-36/h10-14,17-19,22-26,31,35,40-43,52H,6-9,15-16,20-21,27-30,32H2,1-5H3,(H,53,62)(H,54,63)(H,55,59)(H,56,64)(H,57,65)(H,58,66)(H,60,61)(H,67,68,69)/t35?,40-,41-,42-,43+/m0/s1
Reactome pathway
n/an/a 1.80E+3n/an/an/an/an/an/a
EP CNRS 51
Curated by ChEMBL
Assay Description
Inhibition of [125I]-BH-CCK- binding to cholecystokinin type B receptor from guinea pig brain membranes
J Med Chem 36: 3021-8 (1993)
BindingDB Entry DOI: 10.7270/Q2PZ57VG
Cholecystokinin receptor
(Homo sapiens (Human))
BDBM50033636
(3-{2-[2-(2-{2-[2-tert-Butoxycarbonylamino-3-(4-sul...)
Show SMILES CCCC[C@H](NC(=O)[C@H](Cc1ccc(cc1)S(O)(=O)=O)NC(=O)OC(C)(C)C)C(=O)NCC(=O)N[C@H](Cc1c[nH]c2ccccc12)C(=O)N[C@@H](CCCC)C(=O)NC(CCCOc1ccccc1)CC(O)=O
Show InChI InChI=1S/C51H69N7O13S/c1-6-8-20-40(56-48(64)42(58-50(66)71-51(3,4)5)28-33-23-25-37(26-24-33)72(67,68)69)46(62)53-32-44(59)55-43(29-34-31-52-39-22-14-13-19-38(34)39)49(65)57-41(21-9-7-2)47(63)54-35(30-45(60)61)16-15-27-70-36-17-11-10-12-18-36/h10-14,17-19,22-26,31,35,40-43,52H,6-9,15-16,20-21,27-30,32H2,1-5H3,(H,53,62)(H,54,63)(H,55,59)(H,56,64)(H,57,65)(H,58,66)(H,60,61)(H,67,68,69)/t35?,40-,41-,42-,43+/m0/s1
Reactome pathway
n/an/a 1.65E+3n/an/an/an/an/an/a
EP CNRS 51
Curated by ChEMBL
Assay Description
Inhibition of [125I]-BH-CCK- binding to cholecystokinin type B receptor from jurkat Tcells
J Med Chem 36: 3021-8 (1993)
BindingDB Entry DOI: 10.7270/Q2PZ57VG