BDBM50033682 CHEMBL267745::Sodium; (R)-3-acetoxymethyl-8-oxo-7-[1-pyridin-2-yl-meth-(Z)-ylidene]-5-thia-1-aza-bicyclo[4.2.0]oct-2-ene-2-carboxylate
SMILES: CC(=O)OCC1=C(N2[C@H](SC1)\C(=C/c1ccccn1)C2=O)C([O-])=O
InChI Key: InChIKey=CQNPZZNQXQNFCS-NYXMJBRJSA-M
Data: 3 IC50
Activity Spreadsheet -- Enzyme Inhibition Constant Data from BindingDB
Found 3 hits for monomerid = 50033682
Trg + Lig
Ki
nM
ΔG°
kcal/mole
IC50
nM
Kd
nM
EC50/IC50
nM
koff
s-1
kon
M-1s-1
pHTemp
°C
Beta-lactamase
(Enterobacter cloacae)
BDBM50033682
(CHEMBL267745 | Sodium; (R)-3-acetoxymethyl-8-oxo-7...)
Show SMILES CC(=O)OCC1=C(N2[C@H](SC1)\C(=C/c1ccccn1)C2=O)C([O-])=O |t:5|
Show InChI InChI=1S/C16H14N2O5S/c1-9(19)23-7-10-8-24-15-12(6-11-4-2-3-5-17-11)14(20)18(15)13(10)16(21)22/h2-6,15H,7-8H2,1H3,(H,21,22)/p-1/b12-6-/t15-/m1/s1
n/an/a>2.00E+4n/an/an/an/an/an/a
Southern Methodist University
Curated by ChEMBL
Assay Description
The concentration of compound to inhibit Beta-lactamase was measured on E. cloacae SC 12368
J Med Chem 38: 1022-34 (1995)
BindingDB Entry DOI: 10.7270/Q29S1Q29
Beta-lactamase (TEM-1)
(Escherichia coli)
BDBM50033682
(CHEMBL267745 | Sodium; (R)-3-acetoxymethyl-8-oxo-7...)
Show SMILES CC(=O)OCC1=C(N2[C@H](SC1)\C(=C/c1ccccn1)C2=O)C([O-])=O |t:5|
Show InChI InChI=1S/C16H14N2O5S/c1-9(19)23-7-10-8-24-15-12(6-11-4-2-3-5-17-11)14(20)18(15)13(10)16(21)22/h2-6,15H,7-8H2,1H3,(H,21,22)/p-1/b12-6-/t15-/m1/s1
n/an/a>2.00E+3n/an/an/an/an/an/a
Southern Methodist University
Curated by ChEMBL
Assay Description
The concentration of compound to inhibit Beta-lactamase was measured on E. coli WC3310
J Med Chem 38: 1022-34 (1995)
BindingDB Entry DOI: 10.7270/Q29S1Q29
Beta-lactamase
(Enterobacter cloacae)
BDBM50033682
(CHEMBL267745 | Sodium; (R)-3-acetoxymethyl-8-oxo-7...)
Show SMILES CC(=O)OCC1=C(N2[C@H](SC1)\C(=C/c1ccccn1)C2=O)C([O-])=O |t:5|
Show InChI InChI=1S/C16H14N2O5S/c1-9(19)23-7-10-8-24-15-12(6-11-4-2-3-5-17-11)14(20)18(15)13(10)16(21)22/h2-6,15H,7-8H2,1H3,(H,21,22)/p-1/b12-6-/t15-/m1/s1
n/an/a>2.00E+4n/an/an/an/an/an/a
Southern Methodist University
Curated by ChEMBL
Assay Description
The concentration of compound to inhibit Beta-lactamase was measured on Enterobacter cloacae P99
J Med Chem 38: 1022-34 (1995)
BindingDB Entry DOI: 10.7270/Q29S1Q29